{"text_format":"1","workbook":"xlsx","n_sheets":23,"sheets":["Données à modifier","Composition index","Données 3-6 mois glissants","Index","Gazole routier HTT","Fioul lourd","Indice prix","Indices 3-6 mois glissants","Index depuis janvier","Données cumul depuis janvier","Notice d'utilisation Baromètre","Evol index depuis janvier","Evol index 3-6 mois glissants","Indices depuis janvier","Index 3-6 mois glissants","Résultats depuis janvier","Résultats 3-6 mois glissants","Evol indices depuis janvier","Evol indices 3-6 mois glissants","Notice d'utilisation Outil","Résultats date à date","Données dates variables","Noms index"],"not_rendered":{"charts":24,"images":8,"macros":1,"external_links":0,"defined_names":21,"comments":0,"pivot_tables":0},"unopened":[],"bounds":{"document_bytes":16777216,"sheet_cells":100000,"rows_first":2000,"rows_last":500,"rows_between":2000,"halvings":0,"cell_chars":16384,"cell_head_chars":4096},"cells_cut":0,"cells_raw":0,"read":"whole","date_system":"1900"}

{"sheet":"Données à modifier","index":0,"n_rows":6,"n_cols":1,"rows_kept":6,"cut":false,"hidden":true,"merged":[]}
["OCTOBRE"]
["2021-10-01"]
[{"$f":"\"* /2020 = Cumul \"&TEXT('Index depuis janvier'!C2,\"mmm aaaa\")&\"-\"&TEXT('Index depuis janvier'!D2,\"mmm aaaa\")&\" / Cumul \"&TEXT('Index depuis janvier'!E2,\"mmm aaaa\")&\"-\"&TEXT('Index depuis janvier'!F2,\"mmm aaaa\")","v":"* /2020 = Cumul janv 2021-oct 2021 / Cumul janv 2020-oct 2020"}]
[{"$f":"\"* /2019 = Cumul \"&TEXT('Index depuis janvier'!C1,\"mmm aaaa\")&\"-\"&TEXT('Index depuis janvier'!D1,\"mmm aaaa\")&\" / Cumul \"&TEXT('Index depuis janvier'!E1,\"mmm aaaa\")&\"-\"&TEXT('Index depuis janvier'!F1,\"mmm aaaa\")","v":"* /2019 = Cumul janv 2021-oct 2021 / Cumul janv 2019-oct 2019"}]
[{"$f":"\"Cumul \"&TEXT('Index depuis janvier'!C2,\"mmm aaaa\")&\"-\"&TEXT('Index depuis janvier'!D2,\"mmm aaaa\")&\" / Cumul \"&TEXT('Index depuis janvier'!E2,\"mmm aaaa\")&\"-\"&TEXT('Index depuis janvier'!F2,\"mmm aaaa\")","v":"Cumul janv 2021-oct 2021 / Cumul janv 2020-oct 2020"}]
[{"$f":"\"Cumul \"&TEXT('Index depuis janvier'!C1,\"mmm aaaa\")&\"-\"&TEXT('Index depuis janvier'!D1,\"mmm aaaa\")&\" / Cumul \"&TEXT('Index depuis janvier'!E1,\"mmm aaaa\")&\"-\"&TEXT('Index depuis janvier'!F1,\"mmm aaaa\")","v":"Cumul janv 2021-oct 2021 / Cumul janv 2019-oct 2019"}]

{"sheet":"Composition index","index":1,"n_rows":26,"n_cols":44,"rows_kept":26,"cut":false,"hidden":true,"merged":[]}
[null,null,null,"K","L","E","E","S","T","L","E","E","E","M","M","M","M","M","M","M","M","M","M","M","M","M","M","M","M","M","M","M","M","M","M","M","M","M","M","M","M","S","D","D"]
[null,"TP01",null,"Matériel","Travail","GNR","Gazole","Frais divers","Transports routiers","Travail activités spécialisées","Électricité vendue aux entreprises consommatrices finales","Fioul lourd","Gazole routier HTT","Tubes, tuyaux en matière plastique","Ensemble des produits du sciage","Béton prêt à l'emploi","Barres crénelées ou nervurées pour béton armé","Sables et granulats","Plaques, feuilles, tubes et profilés en matières plastiques","Ciment, chaux et plâtre","Produits explosifs","Acier pour la construction","Bitume","Produits de voierie en béton","Mortiers et bétons secs","Travaux de fonderie de fonte","Tuiles, briques et produits de construction en terre cuite","Tuyaux d'assainissement","Autres textiles n.c.a.","Matières plastiques sous formes primaires","Tubes, tuyaux, profilés creux et accessoires correspondants en acier","Éléments en béton pour la construction","Fils et câbles d'énergie","Moteurs, génératrices, transfo. électr., matér. distrib., cmde électr.","Matériel de distribution et de commande électrique","Appareils d'éclairage électrique","Câbles de fibres optiques","Peintures Industries","Produits sidérurgiques en acier non allié","Tôles quarto en aciers non alliés","Éléments en métal pour la construction","Restaurants et hôtels","Traitement et élimination des déchets non dangereux","Collecte, traitement et élimination des déchets ; récupération de matériaux"]
[null,null,null,"001711009","5540998","010534596","001764283","001711011","001711943","001565195","010534769","Fioul lourd","Gazole routier HTT","010534207","010534575","010534646","010546545","010536067","010534625","010534642","010534614","010536462","010534598","010534252","010534647","010534662","010534638","010534253","010534559","010534606","010534654","010534645","010534330","010534696","010534698","010534702","010535345","010534180","010534267","010536480","010534667","001763781","010534789","010534784"]
["TP01"]
["TP02",0.1,{"$f":"SUM(D5:AR5)","v":1.0000000000000002},0.15,0.55000000000000004,null,null,0.01,0.01,null,0.01,null,null,0.04,0.02,0.12,0.09]
["TP03a",0.19,{"$f":"SUM(D6:AR6)","v":1.0000000000000002},0.27,0.28999999999999998,7.0000000000000007E-2,0.01,0.02,0.05,0.04,null,null,null,null,null,null,null,0.12,0.03,0.06,0.01,null,null,null,null,null,null,null,null,null,null,null,null,null,null,null,null,null,null,null,null,null,0.03]
["TP03b",2E-3,1,0.23,0.18,7.0000000000000007E-2,null,0.03,null,0.09,null,null,null,null,null,null,null,null,null,null,0.4]
["TP04",0.04,1,0.16,0.44,0.05,null,0.02,0.03,null,null,null,null,null,null,0.12,0.1,0.02,null,0.03,null,null,null,null,null,null,null,null,null,null,null,null,null,null,null,null,null,null,null,null,null,null,null,0.03]
["TP05a",1.4999999999999999E-2,1.0000000000000002,0.17,0.39,0.01,null,0.05,0.01,null,0.01,null,null,null,null,0.23,7.0000000000000007E-2,null,null,null,0.03,null,null,null,null,null,null,null,null,null,null,null,null,null,null,null,null,null,null,null,null,null,0.03]
["TP05b",1.4999999999999999E-2,1.0000000000000002,0.27,0.33,0.01,null,0.06,0.01,null,0.02,null,null,null,null,0.19,0.06,null,null,null,null,null,null,null,null,null,null,null,null,null,null,null,null,null,null,null,null,null,null,null,null,null,0.05]
["TP06a",8.9999999999999993E-3,1,0.54,0.2,0.02,null,7.0000000000000007E-2,null,null,null,null,0.17]
["TP06b",5.0000000000000001E-3,1,0.47,0.38,0.12,null,0.03]
["TP07b",2E-3,1,0.13,0.2,0.03,null,0.05,0.02,null,null,null,null,null,null,0.08,0.05,null,null,null,null,0.22,null,null,null,null,null,null,null,null,null,null,null,null,null,null,null,null,null,0.22]
["TP08",0.125,0.9900000000000001,0.12,0.22,0.04,0.02,7.0000000000000007E-2,0.15,null,0.01,0.01,null,0.02,null,2.5000000000000001E-2,"ss",0.15,null,null,null,"ss",0.12,1.4999999999999999E-2,0.01,0.01]
["TP09",0.125,1,0.11,0.14000000000000001,0.02,0.02,0.01,0.15,null,0.01,0.04,null,null,null,null,null,0.15,null,null,null,null,0.35]
["TP10a",0.157,1,0.22,0.34,0.02,0.01,0.03,0.04,null,null,null,null,0.09,null,null,null,0.11,null,null,null,null,null,null,null,0.08,0.02,0.01,null,null,null,null,null,null,null,null,null,null,null,null,null,null,null,0.03]
["TP10b",0.02,1,0.25,0.43,0.02,0.02,0.02,0.05,null,null,null,null,null,null,null,null,0.16,null,null,null,null,null,null,null,null,null,null,null,null,null,null,null,null,null,null,null,null,null,null,null,null,null,0.05]
["TP10c",1.4E-2,1,0.25,0.3,0.01,0.02,0.02,0.01,null,null,null,null,null,null,null,null,null,null,null,null,null,null,null,null,null,null,null,0.1,0.28000000000000003,null,null,null,null,null,null,null,null,null,null,null,null,null,0.01]
["TP10d",3.0000000000000001E-3,1,0.22,0.32,0.01,0.01,0.04,0.02,null,null,null,null,null,null,null,null,0.12,null,null,null,null,null,null,null,null,null,null,null,null,0.21,null,null,null,null,null,null,null,null,null,null,null,null,0.05]
["TP11",6.0000000000000001E-3,1,0.14000000000000001,0.18,0.02,0.01,0.03,0.03,null,null,null,null,null,null,null,null,0.08,null,null,null,null,null,null,null,0.37,null,null,null,null,0.12,null,null,null,null,null,null,null,null,null,null,null,null,0.02]
["TP12a",9.2499999999999999E-2,0.99999999999999989,0.1,0.45,8.3999999999999995E-3,3.1600000000000003E-2,7.0000000000000007E-2,null,null,null,null,null,0.02,null,null,null,0.09,null,null,null,null,null,null,null,null,null,null,null,null,null,0.02,0.09,0.12]
["TP12b",1.6E-2,1,0.08,0.24,6.3E-3,2.3699999999999999E-2,0.08,null,null,null,null,null,0.02,null,null,null,0.02,null,null,null,null,null,null,null,null,null,null,null,null,0.22,0.01,0.05,null,null,0.25]
["TP12c",2.4E-2,1,0.13,0.62,6.3E-3,2.3699999999999999E-2,0.09,null,null,null,null,null,null,null,null,null,null,null,null,null,null,null,null,null,null,null,null,null,null,null,null,null,null,null,0.13]
["TP12d",2.75E-2,1,0.08,0.4,null,0.02,0.02,null,0.16,null,null,null,null,null,null,null,0.02,null,null,null,null,null,null,null,null,null,null,null,null,null,0.01,null,null,0.1,null,0.19]
["TP13",0.01,1,0.11,0.47,0.01,null,0.01,0.03,null,0.02,null,null,null,null,null,null,null,null,null,null,null,null,null,null,null,null,null,null,null,null,null,null,null,null,null,null,0.02,0.02,0.31]
["TP14",2E-3,1.0000000000000002,0.17,0.6,0.03,0.03,null,0.03,null,null,null,null,null,null,null,null,null,null,null,null,null,null,null,null,null,null,null,null,null,null,0.02,null,null,null,null,null,null,null,null,0.02,0.1]

{"sheet":"Données 3-6 mois glissants","index":2,"n_rows":88,"n_cols":10,"rows_kept":88,"cut":false,"hidden":true,"merged":[]}
[null,{"$f":"EDATE(date,-2)","v":"2021-08-01"},{"$f":"DATE(2021,MONTH(date),1)","v":"2021-10-01"},{"$f":"EDATE(date,-5)","v":"2021-05-01"},{"$f":"EDATE(date,-3)","v":"2021-07-01"}]
[]
[{"$f":"SUM(IF((INDEX(compo,2,)=\"TP01\")*(INDEX(compo,,1)=$C$13),INDEX(compo,,),0))","v":0.1},{"$f":"EDATE(date,-5)","v":"2021-05-01"},{"$f":"DATE(2021,MONTH(date),1)","v":"2021-10-01"},{"$f":"EDATE(date,-11)","v":"2020-11-01"},{"$f":"EDATE(date,-6)","v":"2021-04-01"}]
[]
["K","Matériel",{"$f":"SUM(IF((INDEX(compo,1,)='Données 3-6 mois glissants'!A5)*(INDEX(compo,,1)=$A$52),INDEX(compo,,),0))","v":0.15},"001711009"]
["L","Travail",{"$f":"SUM(IF((INDEX(compo,1,)='Données 3-6 mois glissants'!A6)*(INDEX(compo,,1)=$A$52),INDEX(compo,,),0))","v":0.55000000000000004},"5540998"]
["E","Energie",{"$f":"SUM(IF((INDEX(compo,1,)='Données 3-6 mois glissants'!A7)*(INDEX(compo,,1)=$A$52),INDEX(compo,,),0))","v":0.01},"010534596"]
["M","Matériaux",{"$f":"SUM(IF((INDEX(compo,1,)='Données 3-6 mois glissants'!A8)*(INDEX(compo,,1)=$A$52),INDEX(compo,,),0))","v":0.27},"001764283"]
["S","Frais divers",{"$f":"SUM(IF((INDEX(compo,1,)='Données 3-6 mois glissants'!A9)*(INDEX(compo,,1)=$A$52),INDEX(compo,,),0))","v":0.01},"001711011"]
["T","Transport",{"$f":"SUM(IF((INDEX(compo,1,)='Données 3-6 mois glissants'!A10)*(INDEX(compo,,1)=$A$52),INDEX(compo,,),0))","v":0.01},"001711943"]
["D","Déchets",{"$f":"SUM(IF((INDEX(compo,1,)='Données 3-6 mois glissants'!A11)*(INDEX(compo,,1)=$A$52),INDEX(compo,,),0))","v":0}]
[null,null,null,"Matériel","Travail","GNR",{"$f":"HLOOKUP(G13,'Indice prix'!$B$2:$AP$5,4,FALSE)","v":"Béton prêt à l'emploi"},{"$f":"HLOOKUP(H13,'Indice prix'!$B$2:$AP$5,4,FALSE)","v":"Barres crénelées ou nervurées pour béton armé"}]
[null,"TP01",{"$f":"'Résultats 3-6 mois glissants'!B4","v":"TP02"},{"$f":"HLOOKUP(D12,'Composition index'!$A$2:$AR$3,2,FALSE)","v":"001711009"},{"$f":"HLOOKUP(E12,'Composition index'!$A$2:$AR$3,2,FALSE)","v":"5540998"},{"$f":"HLOOKUP(F12,'Composition index'!$A$2:$AR$3,2,FALSE)","v":"010534596"},{"$f":"IF(D54>0,E54,\"\")","v":"010534646"},{"$f":"IF(D55>0,E55,\"\")","v":"010546545"}]
[{"$f":"DATE(2018,MONTH(date),1)","v":"2018-10-01"},{"$f":"IF(A14>date,\"\",SUM(IF((INDEX(base_index,1,)=B$13)*(INDEX(base_index,,1)=$A14),INDEX(base_index,,),0)))","v":110.9},{"$f":"IF(A14>date,\"\",IF((SUM(IF((INDEX(base_index,1,)=C$13)*(INDEX(base_index,,1)=$A14),INDEX(base_index,,),0)))=0,#N/A,SUM(IF((INDEX(base_index,1,)=C$13)*(INDEX(base_index,,1)=$A14),INDEX(base_index,,),0))))","v":113},{"$f":"IF(A14>date,\"\",SUM(IF((INDEX(base_indices,1,)=D$13)*(INDEX(base_indices,,1)=$A14),INDEX(base_indices,,),0)))","v":104.3},{"$f":"IF(A14>date,\"\",SUM(IF((INDEX(base_indices,1,)=E$13)*(INDEX(base_indices,,1)=$A14),INDEX(base_indices,,),0)))","v":119.7},{"$f":"IF(A14>date,\"\",SUM(IF((INDEX(base_indices,1,)=F$13)*(INDEX(base_indices,,1)=$A14),INDEX(base_indices,,),0)))","v":132.80000000000001},{"$f":"IF(A14>date,\"\",IF(OR(G$13=\"\",G$13=\"Fioul lourd\"),#N/A,SUM(IF((INDEX(base_indices,1,)=G$13)*(INDEX(base_indices,,1)=$A14),INDEX(base_indices,,),0))))","v":102.2},{"$f":"IF(A14>date,\"\",IF(OR(H$13=\"\",H$13=\"Fioul lourd\"),#N/A,SUM(IF((INDEX(base_indices,1,)=H$13)*(INDEX(base_indices,,1)=$A14),INDEX(base_indices,,),0))))","v":127.8}]
[{"$f":"EDATE(A14,1)","v":"2018-11-01"},{"$f":"IF(A15>date,\"\",SUM(IF((INDEX(base_index,1,)=B$13)*(INDEX(base_index,,1)=$A15),INDEX(base_index,,),0)))","v":111.1},{"$f":"IF(A15>date,\"\",IF((SUM(IF((INDEX(base_index,1,)=C$13)*(INDEX(base_index,,1)=$A15),INDEX(base_index,,),0)))=0,#N/A,SUM(IF((INDEX(base_index,1,)=C$13)*(INDEX(base_index,,1)=$A15),INDEX(base_index,,),0))))","v":113.1},{"$f":"IF(A15>date,\"\",SUM(IF((INDEX(base_indices,1,)=D$13)*(INDEX(base_indices,,1)=$A15),INDEX(base_indices,,),0)))","v":104.3},{"$f":"IF(A15>date,\"\",SUM(IF((INDEX(base_indices,1,)=E$13)*(INDEX(base_indices,,1)=$A15),INDEX(base_indices,,),0)))","v":120},{"$f":"IF(A15>date,\"\",SUM(IF((INDEX(base_indices,1,)=F$13)*(INDEX(base_indices,,1)=$A15),INDEX(base_indices,,),0)))","v":125.8},{"$f":"IF(A15>date,\"\",IF(OR(G$13=\"\",G$13=\"Fioul lourd\"),#N/A,SUM(IF((INDEX(base_indices,1,)=G$13)*(INDEX(base_indices,,1)=$A15),INDEX(base_indices,,),0))))","v":102.4},{"$f":"IF(A15>date,\"\",IF(OR(H$13=\"\",H$13=\"Fioul lourd\"),#N/A,SUM(IF((INDEX(base_indices,1,)=H$13)*(INDEX(base_indices,,1)=$A15),INDEX(base_indices,,),0))))","v":126.6}]
[{"$f":"EDATE(A15,1)","v":"2018-12-01"},{"$f":"IF(A16>date,\"\",SUM(IF((INDEX(base_index,1,)=B$13)*(INDEX(base_index,,1)=$A16),INDEX(base_index,,),0)))","v":110},{"$f":"IF(A16>date,\"\",IF((SUM(IF((INDEX(base_index,1,)=C$13)*(INDEX(base_index,,1)=$A16),INDEX(base_index,,),0)))=0,#N/A,SUM(IF((INDEX(base_index,1,)=C$13)*(INDEX(base_index,,1)=$A16),INDEX(base_index,,),0))))","v":113.2},{"$f":"IF(A16>date,\"\",SUM(IF((INDEX(base_indices,1,)=D$13)*(INDEX(base_indices,,1)=$A16),INDEX(base_indices,,),0)))","v":104.1},{"$f":"IF(A16>date,\"\",SUM(IF((INDEX(base_indices,1,)=E$13)*(INDEX(base_indices,,1)=$A16),INDEX(base_indices,,),0)))","v":120.2},{"$f":"IF(A16>date,\"\",SUM(IF((INDEX(base_indices,1,)=F$13)*(INDEX(base_indices,,1)=$A16),INDEX(base_indices,,),0)))","v":118.1},{"$f":"IF(A16>date,\"\",IF(OR(G$13=\"\",G$13=\"Fioul lourd\"),#N/A,SUM(IF((INDEX(base_indices,1,)=G$13)*(INDEX(base_indices,,1)=$A16),INDEX(base_indices,,),0))))","v":102.2},{"$f":"IF(A16>date,\"\",IF(OR(H$13=\"\",H$13=\"Fioul lourd\"),#N/A,SUM(IF((INDEX(base_indices,1,)=H$13)*(INDEX(base_indices,,1)=$A16),INDEX(base_indices,,),0))))","v":125.5}]
["2019-01-01",{"$f":"IF(A17>date,\"\",SUM(IF((INDEX(base_index,1,)=B$13)*(INDEX(base_index,,1)=$A17),INDEX(base_index,,),0)))","v":109.7},{"$f":"IF(A17>date,\"\",IF((SUM(IF((INDEX(base_index,1,)=C$13)*(INDEX(base_index,,1)=$A17),INDEX(base_index,,),0)))=0,#N/A,SUM(IF((INDEX(base_index,1,)=C$13)*(INDEX(base_index,,1)=$A17),INDEX(base_index,,),0))))","v":113.5},{"$f":"IF(A17>date,\"\",SUM(IF((INDEX(base_indices,1,)=D$13)*(INDEX(base_indices,,1)=$A17),INDEX(base_indices,,),0)))","v":104.7},{"$f":"IF(A17>date,\"\",SUM(IF((INDEX(base_indices,1,)=E$13)*(INDEX(base_indices,,1)=$A17),INDEX(base_indices,,),0)))","v":120.8},{"$f":"IF(A17>date,\"\",SUM(IF((INDEX(base_indices,1,)=F$13)*(INDEX(base_indices,,1)=$A17),INDEX(base_indices,,),0)))","v":118.2},{"$f":"IF(A17>date,\"\",IF(OR(G$13=\"\",G$13=\"Fioul lourd\"),#N/A,SUM(IF((INDEX(base_indices,1,)=G$13)*(INDEX(base_indices,,1)=$A17),INDEX(base_indices,,),0))))","v":103.8},{"$f":"IF(A17>date,\"\",IF(OR(H$13=\"\",H$13=\"Fioul lourd\"),#N/A,SUM(IF((INDEX(base_indices,1,)=H$13)*(INDEX(base_indices,,1)=$A17),INDEX(base_indices,,),0))))","v":124.6}]
["2019-02-01",{"$f":"IF(A18>date,\"\",SUM(IF((INDEX(base_index,1,)=B$13)*(INDEX(base_index,,1)=$A18),INDEX(base_index,,),0)))","v":110.3},{"$f":"IF(A18>date,\"\",IF((SUM(IF((INDEX(base_index,1,)=C$13)*(INDEX(base_index,,1)=$A18),INDEX(base_index,,),0)))=0,#N/A,SUM(IF((INDEX(base_index,1,)=C$13)*(INDEX(base_index,,1)=$A18),INDEX(base_index,,),0))))","v":113.6},{"$f":"IF(A18>date,\"\",SUM(IF((INDEX(base_indices,1,)=D$13)*(INDEX(base_indices,,1)=$A18),INDEX(base_indices,,),0)))","v":104.7},{"$f":"IF(A18>date,\"\",SUM(IF((INDEX(base_indices,1,)=E$13)*(INDEX(base_indices,,1)=$A18),INDEX(base_indices,,),0)))","v":121.4},{"$f":"IF(A18>date,\"\",SUM(IF((INDEX(base_indices,1,)=F$13)*(INDEX(base_indices,,1)=$A18),INDEX(base_indices,,),0)))","v":122.5},{"$f":"IF(A18>date,\"\",IF(OR(G$13=\"\",G$13=\"Fioul lourd\"),#N/A,SUM(IF((INDEX(base_indices,1,)=G$13)*(INDEX(base_indices,,1)=$A18),INDEX(base_indices,,),0))))","v":104.2},{"$f":"IF(A18>date,\"\",IF(OR(H$13=\"\",H$13=\"Fioul lourd\"),#N/A,SUM(IF((INDEX(base_indices,1,)=H$13)*(INDEX(base_indices,,1)=$A18),INDEX(base_indices,,),0))))","v":123.8}]
["2019-03-01",{"$f":"IF(A19>date,\"\",SUM(IF((INDEX(base_index,1,)=B$13)*(INDEX(base_index,,1)=$A19),INDEX(base_index,,),0)))","v":111.3},{"$f":"IF(A19>date,\"\",IF((SUM(IF((INDEX(base_index,1,)=C$13)*(INDEX(base_index,,1)=$A19),INDEX(base_index,,),0)))=0,#N/A,SUM(IF((INDEX(base_index,1,)=C$13)*(INDEX(base_index,,1)=$A19),INDEX(base_index,,),0))))","v":114.1},{"$f":"IF(A19>date,\"\",SUM(IF((INDEX(base_indices,1,)=D$13)*(INDEX(base_indices,,1)=$A19),INDEX(base_indices,,),0)))","v":105.7},{"$f":"IF(A19>date,\"\",SUM(IF((INDEX(base_indices,1,)=E$13)*(INDEX(base_indices,,1)=$A19),INDEX(base_indices,,),0)))","v":122},{"$f":"IF(A19>date,\"\",SUM(IF((INDEX(base_indices,1,)=F$13)*(INDEX(base_indices,,1)=$A19),INDEX(base_indices,,),0)))","v":123.5},{"$f":"IF(A19>date,\"\",IF(OR(G$13=\"\",G$13=\"Fioul lourd\"),#N/A,SUM(IF((INDEX(base_indices,1,)=G$13)*(INDEX(base_indices,,1)=$A19),INDEX(base_indices,,),0))))","v":104.3},{"$f":"IF(A19>date,\"\",IF(OR(H$13=\"\",H$13=\"Fioul lourd\"),#N/A,SUM(IF((INDEX(base_indices,1,)=H$13)*(INDEX(base_indices,,1)=$A19),INDEX(base_indices,,),0))))","v":123.9}]
["2019-04-01",{"$f":"IF(A20>date,\"\",SUM(IF((INDEX(base_index,1,)=B$13)*(INDEX(base_index,,1)=$A20),INDEX(base_index,,),0)))","v":111.6},{"$f":"IF(A20>date,\"\",IF((SUM(IF((INDEX(base_index,1,)=C$13)*(INDEX(base_index,,1)=$A20),INDEX(base_index,,),0)))=0,#N/A,SUM(IF((INDEX(base_index,1,)=C$13)*(INDEX(base_index,,1)=$A20),INDEX(base_index,,),0))))","v":114.1},{"$f":"IF(A20>date,\"\",SUM(IF((INDEX(base_indices,1,)=D$13)*(INDEX(base_indices,,1)=$A20),INDEX(base_indices,,),0)))","v":105.3},{"$f":"IF(A20>date,\"\",SUM(IF((INDEX(base_indices,1,)=E$13)*(INDEX(base_indices,,1)=$A20),INDEX(base_indices,,),0)))","v":122.3},{"$f":"IF(A20>date,\"\",SUM(IF((INDEX(base_indices,1,)=F$13)*(INDEX(base_indices,,1)=$A20),INDEX(base_indices,,),0)))","v":125.8},{"$f":"IF(A20>date,\"\",IF(OR(G$13=\"\",G$13=\"Fioul lourd\"),#N/A,SUM(IF((INDEX(base_indices,1,)=G$13)*(INDEX(base_indices,,1)=$A20),INDEX(base_indices,,),0))))","v":104.1},{"$f":"IF(A20>date,\"\",IF(OR(H$13=\"\",H$13=\"Fioul lourd\"),#N/A,SUM(IF((INDEX(base_indices,1,)=H$13)*(INDEX(base_indices,,1)=$A20),INDEX(base_indices,,),0))))","v":123.8}]
["2019-05-01",{"$f":"IF(A21>date,\"\",SUM(IF((INDEX(base_index,1,)=B$13)*(INDEX(base_index,,1)=$A21),INDEX(base_index,,),0)))","v":111.8},{"$f":"IF(A21>date,\"\",IF((SUM(IF((INDEX(base_index,1,)=C$13)*(INDEX(base_index,,1)=$A21),INDEX(base_index,,),0)))=0,#N/A,SUM(IF((INDEX(base_index,1,)=C$13)*(INDEX(base_index,,1)=$A21),INDEX(base_index,,),0))))","v":114.1},{"$f":"IF(A21>date,\"\",SUM(IF((INDEX(base_indices,1,)=D$13)*(INDEX(base_indices,,1)=$A21),INDEX(base_indices,,),0)))","v":105},{"$f":"IF(A21>date,\"\",SUM(IF((INDEX(base_indices,1,)=E$13)*(INDEX(base_indices,,1)=$A21),INDEX(base_indices,,),0)))","v":122.5},{"$f":"IF(A21>date,\"\",SUM(IF((INDEX(base_indices,1,)=F$13)*(INDEX(base_indices,,1)=$A21),INDEX(base_indices,,),0)))","v":126.4},{"$f":"IF(A21>date,\"\",IF(OR(G$13=\"\",G$13=\"Fioul lourd\"),#N/A,SUM(IF((INDEX(base_indices,1,)=G$13)*(INDEX(base_indices,,1)=$A21),INDEX(base_indices,,),0))))","v":104.9},{"$f":"IF(A21>date,\"\",IF(OR(H$13=\"\",H$13=\"Fioul lourd\"),#N/A,SUM(IF((INDEX(base_indices,1,)=H$13)*(INDEX(base_indices,,1)=$A21),INDEX(base_indices,,),0))))","v":123}]
["2019-06-01",{"$f":"IF(A22>date,\"\",SUM(IF((INDEX(base_index,1,)=B$13)*(INDEX(base_index,,1)=$A22),INDEX(base_index,,),0)))","v":111.5},{"$f":"IF(A22>date,\"\",IF((SUM(IF((INDEX(base_index,1,)=C$13)*(INDEX(base_index,,1)=$A22),INDEX(base_index,,),0)))=0,#N/A,SUM(IF((INDEX(base_index,1,)=C$13)*(INDEX(base_index,,1)=$A22),INDEX(base_index,,),0))))","v":114.3},{"$f":"IF(A22>date,\"\",SUM(IF((INDEX(base_indices,1,)=D$13)*(INDEX(base_indices,,1)=$A22),INDEX(base_indices,,),0)))","v":104.9},{"$f":"IF(A22>date,\"\",SUM(IF((INDEX(base_indices,1,)=E$13)*(INDEX(base_indices,,1)=$A22),INDEX(base_indices,,),0)))","v":122.7},{"$f":"IF(A22>date,\"\",SUM(IF((INDEX(base_indices,1,)=F$13)*(INDEX(base_indices,,1)=$A22),INDEX(base_indices,,),0)))","v":119.9},{"$f":"IF(A22>date,\"\",IF(OR(G$13=\"\",G$13=\"Fioul lourd\"),#N/A,SUM(IF((INDEX(base_indices,1,)=G$13)*(INDEX(base_indices,,1)=$A22),INDEX(base_indices,,),0))))","v":105.3},{"$f":"IF(A22>date,\"\",IF(OR(H$13=\"\",H$13=\"Fioul lourd\"),#N/A,SUM(IF((INDEX(base_indices,1,)=H$13)*(INDEX(base_indices,,1)=$A22),INDEX(base_indices,,),0))))","v":122}]
["2019-07-01",{"$f":"IF(A23>date,\"\",SUM(IF((INDEX(base_index,1,)=B$13)*(INDEX(base_index,,1)=$A23),INDEX(base_index,,),0)))","v":111.5},{"$f":"IF(A23>date,\"\",IF((SUM(IF((INDEX(base_index,1,)=C$13)*(INDEX(base_index,,1)=$A23),INDEX(base_index,,),0)))=0,#N/A,SUM(IF((INDEX(base_index,1,)=C$13)*(INDEX(base_index,,1)=$A23),INDEX(base_index,,),0))))","v":114.5},{"$f":"IF(A23>date,\"\",SUM(IF((INDEX(base_indices,1,)=D$13)*(INDEX(base_indices,,1)=$A23),INDEX(base_indices,,),0)))","v":105},{"$f":"IF(A23>date,\"\",SUM(IF((INDEX(base_indices,1,)=E$13)*(INDEX(base_indices,,1)=$A23),INDEX(base_indices,,),0)))","v":122.9},{"$f":"IF(A23>date,\"\",SUM(IF((INDEX(base_indices,1,)=F$13)*(INDEX(base_indices,,1)=$A23),INDEX(base_indices,,),0)))","v":121.5},{"$f":"IF(A23>date,\"\",IF(OR(G$13=\"\",G$13=\"Fioul lourd\"),#N/A,SUM(IF((INDEX(base_indices,1,)=G$13)*(INDEX(base_indices,,1)=$A23),INDEX(base_indices,,),0))))","v":105.4},{"$f":"IF(A23>date,\"\",IF(OR(H$13=\"\",H$13=\"Fioul lourd\"),#N/A,SUM(IF((INDEX(base_indices,1,)=H$13)*(INDEX(base_indices,,1)=$A23),INDEX(base_indices,,),0))))","v":120.5}]
["2019-08-01",{"$f":"IF(A24>date,\"\",SUM(IF((INDEX(base_index,1,)=B$13)*(INDEX(base_index,,1)=$A24),INDEX(base_index,,),0)))","v":111.5},{"$f":"IF(A24>date,\"\",IF((SUM(IF((INDEX(base_index,1,)=C$13)*(INDEX(base_index,,1)=$A24),INDEX(base_index,,),0)))=0,#N/A,SUM(IF((INDEX(base_index,1,)=C$13)*(INDEX(base_index,,1)=$A24),INDEX(base_index,,),0))))","v":114.7},{"$f":"IF(A24>date,\"\",SUM(IF((INDEX(base_indices,1,)=D$13)*(INDEX(base_indices,,1)=$A24),INDEX(base_indices,,),0)))","v":105.1},{"$f":"IF(A24>date,\"\",SUM(IF((INDEX(base_indices,1,)=E$13)*(INDEX(base_indices,,1)=$A24),INDEX(base_indices,,),0)))","v":123.1},{"$f":"IF(A24>date,\"\",SUM(IF((INDEX(base_indices,1,)=F$13)*(INDEX(base_indices,,1)=$A24),INDEX(base_indices,,),0)))","v":119.9},{"$f":"IF(A24>date,\"\",IF(OR(G$13=\"\",G$13=\"Fioul lourd\"),#N/A,SUM(IF((INDEX(base_indices,1,)=G$13)*(INDEX(base_indices,,1)=$A24),INDEX(base_indices,,),0))))","v":106.7},{"$f":"IF(A24>date,\"\",IF(OR(H$13=\"\",H$13=\"Fioul lourd\"),#N/A,SUM(IF((INDEX(base_indices,1,)=H$13)*(INDEX(base_indices,,1)=$A24),INDEX(base_indices,,),0))))","v":119.8}]
["2019-09-01",{"$f":"IF(A25>date,\"\",SUM(IF((INDEX(base_index,1,)=B$13)*(INDEX(base_index,,1)=$A25),INDEX(base_index,,),0)))","v":111.2},{"$f":"IF(A25>date,\"\",IF((SUM(IF((INDEX(base_index,1,)=C$13)*(INDEX(base_index,,1)=$A25),INDEX(base_index,,),0)))=0,#N/A,SUM(IF((INDEX(base_index,1,)=C$13)*(INDEX(base_index,,1)=$A25),INDEX(base_index,,),0))))","v":114.6},{"$f":"IF(A25>date,\"\",SUM(IF((INDEX(base_indices,1,)=D$13)*(INDEX(base_indices,,1)=$A25),INDEX(base_indices,,),0)))","v":105.7},{"$f":"IF(A25>date,\"\",SUM(IF((INDEX(base_indices,1,)=E$13)*(INDEX(base_indices,,1)=$A25),INDEX(base_indices,,),0)))","v":123.3},{"$f":"IF(A25>date,\"\",SUM(IF((INDEX(base_indices,1,)=F$13)*(INDEX(base_indices,,1)=$A25),INDEX(base_indices,,),0)))","v":123.3},{"$f":"IF(A25>date,\"\",IF(OR(G$13=\"\",G$13=\"Fioul lourd\"),#N/A,SUM(IF((INDEX(base_indices,1,)=G$13)*(INDEX(base_indices,,1)=$A25),INDEX(base_indices,,),0))))","v":105.2},{"$f":"IF(A25>date,\"\",IF(OR(H$13=\"\",H$13=\"Fioul lourd\"),#N/A,SUM(IF((INDEX(base_indices,1,)=H$13)*(INDEX(base_indices,,1)=$A25),INDEX(base_indices,,),0))))","v":118.3}]
["2019-10-01",{"$f":"IF(A26>date,\"\",SUM(IF((INDEX(base_index,1,)=B$13)*(INDEX(base_index,,1)=$A26),INDEX(base_index,,),0)))","v":111.2},{"$f":"IF(A26>date,\"\",IF((SUM(IF((INDEX(base_index,1,)=C$13)*(INDEX(base_index,,1)=$A26),INDEX(base_index,,),0)))=0,#N/A,SUM(IF((INDEX(base_index,1,)=C$13)*(INDEX(base_index,,1)=$A26),INDEX(base_index,,),0))))","v":114.2},{"$f":"IF(A26>date,\"\",SUM(IF((INDEX(base_indices,1,)=D$13)*(INDEX(base_indices,,1)=$A26),INDEX(base_indices,,),0)))","v":105.6},{"$f":"IF(A26>date,\"\",SUM(IF((INDEX(base_indices,1,)=E$13)*(INDEX(base_indices,,1)=$A26),INDEX(base_indices,,),0)))","v":123.5},{"$f":"IF(A26>date,\"\",SUM(IF((INDEX(base_indices,1,)=F$13)*(INDEX(base_indices,,1)=$A26),INDEX(base_indices,,),0)))","v":122.4},{"$f":"IF(A26>date,\"\",IF(OR(G$13=\"\",G$13=\"Fioul lourd\"),#N/A,SUM(IF((INDEX(base_indices,1,)=G$13)*(INDEX(base_indices,,1)=$A26),INDEX(base_indices,,),0))))","v":104.7},{"$f":"IF(A26>date,\"\",IF(OR(H$13=\"\",H$13=\"Fioul lourd\"),#N/A,SUM(IF((INDEX(base_indices,1,)=H$13)*(INDEX(base_indices,,1)=$A26),INDEX(base_indices,,),0))))","v":114.1}]
["2019-11-01",{"$f":"IF(A27>date,\"\",SUM(IF((INDEX(base_index,1,)=B$13)*(INDEX(base_index,,1)=$A27),INDEX(base_index,,),0)))","v":110.5},{"$f":"IF(A27>date,\"\",IF((SUM(IF((INDEX(base_index,1,)=C$13)*(INDEX(base_index,,1)=$A27),INDEX(base_index,,),0)))=0,#N/A,SUM(IF((INDEX(base_index,1,)=C$13)*(INDEX(base_index,,1)=$A27),INDEX(base_index,,),0))))","v":114.2},{"$f":"IF(A27>date,\"\",SUM(IF((INDEX(base_indices,1,)=D$13)*(INDEX(base_indices,,1)=$A27),INDEX(base_indices,,),0)))","v":105.1},{"$f":"IF(A27>date,\"\",SUM(IF((INDEX(base_indices,1,)=E$13)*(INDEX(base_indices,,1)=$A27),INDEX(base_indices,,),0)))","v":123.7},{"$f":"IF(A27>date,\"\",SUM(IF((INDEX(base_indices,1,)=F$13)*(INDEX(base_indices,,1)=$A27),INDEX(base_indices,,),0)))","v":122.5},{"$f":"IF(A27>date,\"\",IF(OR(G$13=\"\",G$13=\"Fioul lourd\"),#N/A,SUM(IF((INDEX(base_indices,1,)=G$13)*(INDEX(base_indices,,1)=$A27),INDEX(base_indices,,),0))))","v":104.5},{"$f":"IF(A27>date,\"\",IF(OR(H$13=\"\",H$13=\"Fioul lourd\"),#N/A,SUM(IF((INDEX(base_indices,1,)=H$13)*(INDEX(base_indices,,1)=$A27),INDEX(base_indices,,),0))))","v":111.3}]
["2019-12-01",{"$f":"IF(A28>date,\"\",SUM(IF((INDEX(base_index,1,)=B$13)*(INDEX(base_index,,1)=$A28),INDEX(base_index,,),0)))","v":110.4},{"$f":"IF(A28>date,\"\",IF((SUM(IF((INDEX(base_index,1,)=C$13)*(INDEX(base_index,,1)=$A28),INDEX(base_index,,),0)))=0,#N/A,SUM(IF((INDEX(base_index,1,)=C$13)*(INDEX(base_index,,1)=$A28),INDEX(base_index,,),0))))","v":114.3},{"$f":"IF(A28>date,\"\",SUM(IF((INDEX(base_indices,1,)=D$13)*(INDEX(base_indices,,1)=$A28),INDEX(base_indices,,),0)))","v":104.6},{"$f":"IF(A28>date,\"\",SUM(IF((INDEX(base_indices,1,)=E$13)*(INDEX(base_indices,,1)=$A28),INDEX(base_indices,,),0)))","v":123.9},{"$f":"IF(A28>date,\"\",SUM(IF((INDEX(base_indices,1,)=F$13)*(INDEX(base_indices,,1)=$A28),INDEX(base_indices,,),0)))","v":124.1},{"$f":"IF(A28>date,\"\",IF(OR(G$13=\"\",G$13=\"Fioul lourd\"),#N/A,SUM(IF((INDEX(base_indices,1,)=G$13)*(INDEX(base_indices,,1)=$A28),INDEX(base_indices,,),0))))","v":104.8},{"$f":"IF(A28>date,\"\",IF(OR(H$13=\"\",H$13=\"Fioul lourd\"),#N/A,SUM(IF((INDEX(base_indices,1,)=H$13)*(INDEX(base_indices,,1)=$A28),INDEX(base_indices,,),0))))","v":111.2}]
["2020-01-01",{"$f":"IF(A29>date,\"\",SUM(IF((INDEX(base_index,1,)=B$13)*(INDEX(base_index,,1)=$A29),INDEX(base_index,,),0)))","v":111.4},{"$f":"IF(A29>date,\"\",IF((SUM(IF((INDEX(base_index,1,)=C$13)*(INDEX(base_index,,1)=$A29),INDEX(base_index,,),0)))=0,#N/A,SUM(IF((INDEX(base_index,1,)=C$13)*(INDEX(base_index,,1)=$A29),INDEX(base_index,,),0))))","v":114.7},{"$f":"IF(A29>date,\"\",SUM(IF((INDEX(base_indices,1,)=D$13)*(INDEX(base_indices,,1)=$A29),INDEX(base_indices,,),0)))","v":104.7},{"$f":"IF(A29>date,\"\",SUM(IF((INDEX(base_indices,1,)=E$13)*(INDEX(base_indices,,1)=$A29),INDEX(base_indices,,),0)))","v":123.7},{"$f":"IF(A29>date,\"\",SUM(IF((INDEX(base_indices,1,)=F$13)*(INDEX(base_indices,,1)=$A29),INDEX(base_indices,,),0)))","v":120.9},{"$f":"IF(A29>date,\"\",IF(OR(G$13=\"\",G$13=\"Fioul lourd\"),#N/A,SUM(IF((INDEX(base_indices,1,)=G$13)*(INDEX(base_indices,,1)=$A29),INDEX(base_indices,,),0))))","v":105.2},{"$f":"IF(A29>date,\"\",IF(OR(H$13=\"\",H$13=\"Fioul lourd\"),#N/A,SUM(IF((INDEX(base_indices,1,)=H$13)*(INDEX(base_indices,,1)=$A29),INDEX(base_indices,,),0))))","v":112.6}]
["2020-02-01",{"$f":"IF(A30>date,\"\",SUM(IF((INDEX(base_index,1,)=B$13)*(INDEX(base_index,,1)=$A30),INDEX(base_index,,),0)))","v":111.7},{"$f":"IF(A30>date,\"\",IF((SUM(IF((INDEX(base_index,1,)=C$13)*(INDEX(base_index,,1)=$A30),INDEX(base_index,,),0)))=0,#N/A,SUM(IF((INDEX(base_index,1,)=C$13)*(INDEX(base_index,,1)=$A30),INDEX(base_index,,),0))))","v":114.8},{"$f":"IF(A30>date,\"\",SUM(IF((INDEX(base_indices,1,)=D$13)*(INDEX(base_indices,,1)=$A30),INDEX(base_indices,,),0)))","v":105.5},{"$f":"IF(A30>date,\"\",SUM(IF((INDEX(base_indices,1,)=E$13)*(INDEX(base_indices,,1)=$A30),INDEX(base_indices,,),0)))","v":123.5},{"$f":"IF(A30>date,\"\",SUM(IF((INDEX(base_indices,1,)=F$13)*(INDEX(base_indices,,1)=$A30),INDEX(base_indices,,),0)))","v":115.3},{"$f":"IF(A30>date,\"\",IF(OR(G$13=\"\",G$13=\"Fioul lourd\"),#N/A,SUM(IF((INDEX(base_indices,1,)=G$13)*(INDEX(base_indices,,1)=$A30),INDEX(base_indices,,),0))))","v":103.7},{"$f":"IF(A30>date,\"\",IF(OR(H$13=\"\",H$13=\"Fioul lourd\"),#N/A,SUM(IF((INDEX(base_indices,1,)=H$13)*(INDEX(base_indices,,1)=$A30),INDEX(base_indices,,),0))))","v":113.5}]
["2020-03-01",{"$f":"IF(A31>date,\"\",SUM(IF((INDEX(base_index,1,)=B$13)*(INDEX(base_index,,1)=$A31),INDEX(base_index,,),0)))","v":110.8},{"$f":"IF(A31>date,\"\",IF((SUM(IF((INDEX(base_index,1,)=C$13)*(INDEX(base_index,,1)=$A31),INDEX(base_index,,),0)))=0,#N/A,SUM(IF((INDEX(base_index,1,)=C$13)*(INDEX(base_index,,1)=$A31),INDEX(base_index,,),0))))","v":114.7},{"$f":"IF(A31>date,\"\",SUM(IF((INDEX(base_indices,1,)=D$13)*(INDEX(base_indices,,1)=$A31),INDEX(base_indices,,),0)))","v":105.3},{"$f":"IF(A31>date,\"\",SUM(IF((INDEX(base_indices,1,)=E$13)*(INDEX(base_indices,,1)=$A31),INDEX(base_indices,,),0)))","v":123.3},{"$f":"IF(A31>date,\"\",SUM(IF((INDEX(base_indices,1,)=F$13)*(INDEX(base_indices,,1)=$A31),INDEX(base_indices,,),0)))","v":99.2},{"$f":"IF(A31>date,\"\",IF(OR(G$13=\"\",G$13=\"Fioul lourd\"),#N/A,SUM(IF((INDEX(base_indices,1,)=G$13)*(INDEX(base_indices,,1)=$A31),INDEX(base_indices,,),0))))","v":103.5},{"$f":"IF(A31>date,\"\",IF(OR(H$13=\"\",H$13=\"Fioul lourd\"),#N/A,SUM(IF((INDEX(base_indices,1,)=H$13)*(INDEX(base_indices,,1)=$A31),INDEX(base_indices,,),0))))","v":112.3}]
["2020-04-01",{"$f":"IF(A32>date,\"\",SUM(IF((INDEX(base_index,1,)=B$13)*(INDEX(base_index,,1)=$A32),INDEX(base_index,,),0)))","v":108.9},{"$f":"IF(A32>date,\"\",IF((SUM(IF((INDEX(base_index,1,)=C$13)*(INDEX(base_index,,1)=$A32),INDEX(base_index,,),0)))=0,#N/A,SUM(IF((INDEX(base_index,1,)=C$13)*(INDEX(base_index,,1)=$A32),INDEX(base_index,,),0))))","v":114.4},{"$f":"IF(A32>date,\"\",SUM(IF((INDEX(base_indices,1,)=D$13)*(INDEX(base_indices,,1)=$A32),INDEX(base_indices,,),0)))","v":105.5},{"$f":"IF(A32>date,\"\",SUM(IF((INDEX(base_indices,1,)=E$13)*(INDEX(base_indices,,1)=$A32),INDEX(base_indices,,),0)))","v":123.6},{"$f":"IF(A32>date,\"\",SUM(IF((INDEX(base_indices,1,)=F$13)*(INDEX(base_indices,,1)=$A32),INDEX(base_indices,,),0)))","v":88.2},{"$f":"IF(A32>date,\"\",IF(OR(G$13=\"\",G$13=\"Fioul lourd\"),#N/A,SUM(IF((INDEX(base_indices,1,)=G$13)*(INDEX(base_indices,,1)=$A32),INDEX(base_indices,,),0))))","v":102.7},{"$f":"IF(A32>date,\"\",IF(OR(H$13=\"\",H$13=\"Fioul lourd\"),#N/A,SUM(IF((INDEX(base_indices,1,)=H$13)*(INDEX(base_indices,,1)=$A32),INDEX(base_indices,,),0))))","v":112.1}]
["2020-05-01",{"$f":"IF(A33>date,\"\",SUM(IF((INDEX(base_index,1,)=B$13)*(INDEX(base_index,,1)=$A33),INDEX(base_index,,),0)))","v":108.7},{"$f":"IF(A33>date,\"\",IF((SUM(IF((INDEX(base_index,1,)=C$13)*(INDEX(base_index,,1)=$A33),INDEX(base_index,,),0)))=0,#N/A,SUM(IF((INDEX(base_index,1,)=C$13)*(INDEX(base_index,,1)=$A33),INDEX(base_index,,),0))))","v":114.2},{"$f":"IF(A33>date,\"\",SUM(IF((INDEX(base_indices,1,)=D$13)*(INDEX(base_indices,,1)=$A33),INDEX(base_indices,,),0)))","v":104.9},{"$f":"IF(A33>date,\"\",SUM(IF((INDEX(base_indices,1,)=E$13)*(INDEX(base_indices,,1)=$A33),INDEX(base_indices,,),0)))","v":123.8},{"$f":"IF(A33>date,\"\",SUM(IF((INDEX(base_indices,1,)=F$13)*(INDEX(base_indices,,1)=$A33),INDEX(base_indices,,),0)))","v":91.2},{"$f":"IF(A33>date,\"\",IF(OR(G$13=\"\",G$13=\"Fioul lourd\"),#N/A,SUM(IF((INDEX(base_indices,1,)=G$13)*(INDEX(base_indices,,1)=$A33),INDEX(base_indices,,),0))))","v":104.4},{"$f":"IF(A33>date,\"\",IF(OR(H$13=\"\",H$13=\"Fioul lourd\"),#N/A,SUM(IF((INDEX(base_indices,1,)=H$13)*(INDEX(base_indices,,1)=$A33),INDEX(base_indices,,),0))))","v":111.3}]
["2020-06-01",{"$f":"IF(A34>date,\"\",SUM(IF((INDEX(base_index,1,)=B$13)*(INDEX(base_index,,1)=$A34),INDEX(base_index,,),0)))","v":108.8},{"$f":"IF(A34>date,\"\",IF((SUM(IF((INDEX(base_index,1,)=C$13)*(INDEX(base_index,,1)=$A34),INDEX(base_index,,),0)))=0,#N/A,SUM(IF((INDEX(base_index,1,)=C$13)*(INDEX(base_index,,1)=$A34),INDEX(base_index,,),0))))","v":113.7},{"$f":"IF(A34>date,\"\",SUM(IF((INDEX(base_indices,1,)=D$13)*(INDEX(base_indices,,1)=$A34),INDEX(base_indices,,),0)))","v":103},{"$f":"IF(A34>date,\"\",SUM(IF((INDEX(base_indices,1,)=E$13)*(INDEX(base_indices,,1)=$A34),INDEX(base_indices,,),0)))","v":124},{"$f":"IF(A34>date,\"\",SUM(IF((INDEX(base_indices,1,)=F$13)*(INDEX(base_indices,,1)=$A34),INDEX(base_indices,,),0)))","v":97.2},{"$f":"IF(A34>date,\"\",IF(OR(G$13=\"\",G$13=\"Fioul lourd\"),#N/A,SUM(IF((INDEX(base_indices,1,)=G$13)*(INDEX(base_indices,,1)=$A34),INDEX(base_indices,,),0))))","v":105.4},{"$f":"IF(A34>date,\"\",IF(OR(H$13=\"\",H$13=\"Fioul lourd\"),#N/A,SUM(IF((INDEX(base_indices,1,)=H$13)*(INDEX(base_indices,,1)=$A34),INDEX(base_indices,,),0))))","v":109.7}]
["2020-07-01",{"$f":"IF(A35>date,\"\",SUM(IF((INDEX(base_index,1,)=B$13)*(INDEX(base_index,,1)=$A35),INDEX(base_index,,),0)))","v":109.9},{"$f":"IF(A35>date,\"\",IF((SUM(IF((INDEX(base_index,1,)=C$13)*(INDEX(base_index,,1)=$A35),INDEX(base_index,,),0)))=0,#N/A,SUM(IF((INDEX(base_index,1,)=C$13)*(INDEX(base_index,,1)=$A35),INDEX(base_index,,),0))))","v":113.7},{"$f":"IF(A35>date,\"\",SUM(IF((INDEX(base_indices,1,)=D$13)*(INDEX(base_indices,,1)=$A35),INDEX(base_indices,,),0)))","v":102.6},{"$f":"IF(A35>date,\"\",SUM(IF((INDEX(base_indices,1,)=E$13)*(INDEX(base_indices,,1)=$A35),INDEX(base_indices,,),0)))","v":123.8},{"$f":"IF(A35>date,\"\",SUM(IF((INDEX(base_indices,1,)=F$13)*(INDEX(base_indices,,1)=$A35),INDEX(base_indices,,),0)))","v":99.7},{"$f":"IF(A35>date,\"\",IF(OR(G$13=\"\",G$13=\"Fioul lourd\"),#N/A,SUM(IF((INDEX(base_indices,1,)=G$13)*(INDEX(base_indices,,1)=$A35),INDEX(base_indices,,),0))))","v":105.6},{"$f":"IF(A35>date,\"\",IF(OR(H$13=\"\",H$13=\"Fioul lourd\"),#N/A,SUM(IF((INDEX(base_indices,1,)=H$13)*(INDEX(base_indices,,1)=$A35),INDEX(base_indices,,),0))))","v":108}]
["2020-08-01",{"$f":"IF(A36>date,\"\",SUM(IF((INDEX(base_index,1,)=B$13)*(INDEX(base_index,,1)=$A36),INDEX(base_index,,),0)))","v":110},{"$f":"IF(A36>date,\"\",IF((SUM(IF((INDEX(base_index,1,)=C$13)*(INDEX(base_index,,1)=$A36),INDEX(base_index,,),0)))=0,#N/A,SUM(IF((INDEX(base_index,1,)=C$13)*(INDEX(base_index,,1)=$A36),INDEX(base_index,,),0))))","v":113.8},{"$f":"IF(A36>date,\"\",SUM(IF((INDEX(base_indices,1,)=D$13)*(INDEX(base_indices,,1)=$A36),INDEX(base_indices,,),0)))","v":102.8},{"$f":"IF(A36>date,\"\",SUM(IF((INDEX(base_indices,1,)=E$13)*(INDEX(base_indices,,1)=$A36),INDEX(base_indices,,),0)))","v":123.7},{"$f":"IF(A36>date,\"\",SUM(IF((INDEX(base_indices,1,)=F$13)*(INDEX(base_indices,,1)=$A36),INDEX(base_indices,,),0)))","v":98.3},{"$f":"IF(A36>date,\"\",IF(OR(G$13=\"\",G$13=\"Fioul lourd\"),#N/A,SUM(IF((INDEX(base_indices,1,)=G$13)*(INDEX(base_indices,,1)=$A36),INDEX(base_indices,,),0))))","v":105.4},{"$f":"IF(A36>date,\"\",IF(OR(H$13=\"\",H$13=\"Fioul lourd\"),#N/A,SUM(IF((INDEX(base_indices,1,)=H$13)*(INDEX(base_indices,,1)=$A36),INDEX(base_indices,,),0))))","v":107.4}]
["2020-09-01",{"$f":"IF(A37>date,\"\",SUM(IF((INDEX(base_index,1,)=B$13)*(INDEX(base_index,,1)=$A37),INDEX(base_index,,),0)))","v":110.1},{"$f":"IF(A37>date,\"\",IF((SUM(IF((INDEX(base_index,1,)=C$13)*(INDEX(base_index,,1)=$A37),INDEX(base_index,,),0)))=0,#N/A,SUM(IF((INDEX(base_index,1,)=C$13)*(INDEX(base_index,,1)=$A37),INDEX(base_index,,),0))))","v":114.4},{"$f":"IF(A37>date,\"\",SUM(IF((INDEX(base_indices,1,)=D$13)*(INDEX(base_indices,,1)=$A37),INDEX(base_indices,,),0)))","v":104.4},{"$f":"IF(A37>date,\"\",SUM(IF((INDEX(base_indices,1,)=E$13)*(INDEX(base_indices,,1)=$A37),INDEX(base_indices,,),0)))","v":123.6},{"$f":"IF(A37>date,\"\",SUM(IF((INDEX(base_indices,1,)=F$13)*(INDEX(base_indices,,1)=$A37),INDEX(base_indices,,),0)))","v":94.9},{"$f":"IF(A37>date,\"\",IF(OR(G$13=\"\",G$13=\"Fioul lourd\"),#N/A,SUM(IF((INDEX(base_indices,1,)=G$13)*(INDEX(base_indices,,1)=$A37),INDEX(base_indices,,),0))))","v":106.5},{"$f":"IF(A37>date,\"\",IF(OR(H$13=\"\",H$13=\"Fioul lourd\"),#N/A,SUM(IF((INDEX(base_indices,1,)=H$13)*(INDEX(base_indices,,1)=$A37),INDEX(base_indices,,),0))))","v":108.5}]
["2020-10-01",{"$f":"IF(A38>date,\"\",SUM(IF((INDEX(base_index,1,)=B$13)*(INDEX(base_index,,1)=$A38),INDEX(base_index,,),0)))","v":109.5},{"$f":"IF(A38>date,\"\",IF((SUM(IF((INDEX(base_index,1,)=C$13)*(INDEX(base_index,,1)=$A38),INDEX(base_index,,),0)))=0,#N/A,SUM(IF((INDEX(base_index,1,)=C$13)*(INDEX(base_index,,1)=$A38),INDEX(base_index,,),0))))","v":114.4},{"$f":"IF(A38>date,\"\",SUM(IF((INDEX(base_indices,1,)=D$13)*(INDEX(base_indices,,1)=$A38),INDEX(base_indices,,),0)))","v":104.1},{"$f":"IF(A38>date,\"\",SUM(IF((INDEX(base_indices,1,)=E$13)*(INDEX(base_indices,,1)=$A38),INDEX(base_indices,,),0)))","v":123.5},{"$f":"IF(A38>date,\"\",SUM(IF((INDEX(base_indices,1,)=F$13)*(INDEX(base_indices,,1)=$A38),INDEX(base_indices,,),0)))","v":95},{"$f":"IF(A38>date,\"\",IF(OR(G$13=\"\",G$13=\"Fioul lourd\"),#N/A,SUM(IF((INDEX(base_indices,1,)=G$13)*(INDEX(base_indices,,1)=$A38),INDEX(base_indices,,),0))))","v":105.9},{"$f":"IF(A38>date,\"\",IF(OR(H$13=\"\",H$13=\"Fioul lourd\"),#N/A,SUM(IF((INDEX(base_indices,1,)=H$13)*(INDEX(base_indices,,1)=$A38),INDEX(base_indices,,),0))))","v":110.7}]
["2020-11-01",{"$f":"IF(A39>date,\"\",SUM(IF((INDEX(base_index,1,)=B$13)*(INDEX(base_index,,1)=$A39),INDEX(base_index,,),0)))","v":109.5},{"$f":"IF(A39>date,\"\",IF((SUM(IF((INDEX(base_index,1,)=C$13)*(INDEX(base_index,,1)=$A39),INDEX(base_index,,),0)))=0,#N/A,SUM(IF((INDEX(base_index,1,)=C$13)*(INDEX(base_index,,1)=$A39),INDEX(base_index,,),0))))","v":114.5},{"$f":"IF(A39>date,\"\",SUM(IF((INDEX(base_indices,1,)=D$13)*(INDEX(base_indices,,1)=$A39),INDEX(base_indices,,),0)))","v":104.4},{"$f":"IF(A39>date,\"\",SUM(IF((INDEX(base_indices,1,)=E$13)*(INDEX(base_indices,,1)=$A39),INDEX(base_indices,,),0)))","v":123.5},{"$f":"IF(A39>date,\"\",SUM(IF((INDEX(base_indices,1,)=F$13)*(INDEX(base_indices,,1)=$A39),INDEX(base_indices,,),0)))","v":96.6},{"$f":"IF(A39>date,\"\",IF(OR(G$13=\"\",G$13=\"Fioul lourd\"),#N/A,SUM(IF((INDEX(base_indices,1,)=G$13)*(INDEX(base_indices,,1)=$A39),INDEX(base_indices,,),0))))","v":105.4},{"$f":"IF(A39>date,\"\",IF(OR(H$13=\"\",H$13=\"Fioul lourd\"),#N/A,SUM(IF((INDEX(base_indices,1,)=H$13)*(INDEX(base_indices,,1)=$A39),INDEX(base_indices,,),0))))","v":112.6}]
["2020-12-01",{"$f":"IF(A40>date,\"\",SUM(IF((INDEX(base_index,1,)=B$13)*(INDEX(base_index,,1)=$A40),INDEX(base_index,,),0)))","v":109.8},{"$f":"IF(A40>date,\"\",IF((SUM(IF((INDEX(base_index,1,)=C$13)*(INDEX(base_index,,1)=$A40),INDEX(base_index,,),0)))=0,#N/A,SUM(IF((INDEX(base_index,1,)=C$13)*(INDEX(base_index,,1)=$A40),INDEX(base_index,,),0))))","v":114.9},{"$f":"IF(A40>date,\"\",SUM(IF((INDEX(base_indices,1,)=D$13)*(INDEX(base_indices,,1)=$A40),INDEX(base_indices,,),0)))","v":104.4},{"$f":"IF(A40>date,\"\",SUM(IF((INDEX(base_indices,1,)=E$13)*(INDEX(base_indices,,1)=$A40),INDEX(base_indices,,),0)))","v":123.4},{"$f":"IF(A40>date,\"\",SUM(IF((INDEX(base_indices,1,)=F$13)*(INDEX(base_indices,,1)=$A40),INDEX(base_indices,,),0)))","v":101.2},{"$f":"IF(A40>date,\"\",IF(OR(G$13=\"\",G$13=\"Fioul lourd\"),#N/A,SUM(IF((INDEX(base_indices,1,)=G$13)*(INDEX(base_indices,,1)=$A40),INDEX(base_indices,,),0))))","v":104.7},{"$f":"IF(A40>date,\"\",IF(OR(H$13=\"\",H$13=\"Fioul lourd\"),#N/A,SUM(IF((INDEX(base_indices,1,)=H$13)*(INDEX(base_indices,,1)=$A40),INDEX(base_indices,,),0))))","v":116.1}]
["2021-01-01",{"$f":"IF(A41>date,\"\",SUM(IF((INDEX(base_index,1,)=B$13)*(INDEX(base_index,,1)=$A41),INDEX(base_index,,),0)))","v":111.2},{"$f":"IF(A41>date,\"\",IF((SUM(IF((INDEX(base_index,1,)=C$13)*(INDEX(base_index,,1)=$A41),INDEX(base_index,,),0)))=0,#N/A,SUM(IF((INDEX(base_index,1,)=C$13)*(INDEX(base_index,,1)=$A41),INDEX(base_index,,),0))))","v":116.3},{"$f":"IF(A41>date,\"\",SUM(IF((INDEX(base_indices,1,)=D$13)*(INDEX(base_indices,,1)=$A41),INDEX(base_indices,,),0)))","v":104.5},{"$f":"IF(A41>date,\"\",SUM(IF((INDEX(base_indices,1,)=E$13)*(INDEX(base_indices,,1)=$A41),INDEX(base_indices,,),0)))","v":123.4},{"$f":"IF(A41>date,\"\",SUM(IF((INDEX(base_indices,1,)=F$13)*(INDEX(base_indices,,1)=$A41),INDEX(base_indices,,),0)))","v":104.6},{"$f":"IF(A41>date,\"\",IF(OR(G$13=\"\",G$13=\"Fioul lourd\"),#N/A,SUM(IF((INDEX(base_indices,1,)=G$13)*(INDEX(base_indices,,1)=$A41),INDEX(base_indices,,),0))))","v":105.8},{"$f":"IF(A41>date,\"\",IF(OR(H$13=\"\",H$13=\"Fioul lourd\"),#N/A,SUM(IF((INDEX(base_indices,1,)=H$13)*(INDEX(base_indices,,1)=$A41),INDEX(base_indices,,),0))))","v":130.80000000000001}]
["2021-02-01",{"$f":"IF(A42>date,\"\",SUM(IF((INDEX(base_index,1,)=B$13)*(INDEX(base_index,,1)=$A42),INDEX(base_index,,),0)))","v":112.1},{"$f":"IF(A42>date,\"\",IF((SUM(IF((INDEX(base_index,1,)=C$13)*(INDEX(base_index,,1)=$A42),INDEX(base_index,,),0)))=0,#N/A,SUM(IF((INDEX(base_index,1,)=C$13)*(INDEX(base_index,,1)=$A42),INDEX(base_index,,),0))))","v":117.2},{"$f":"IF(A42>date,\"\",SUM(IF((INDEX(base_indices,1,)=D$13)*(INDEX(base_indices,,1)=$A42),INDEX(base_indices,,),0)))","v":104.5},{"$f":"IF(A42>date,\"\",SUM(IF((INDEX(base_indices,1,)=E$13)*(INDEX(base_indices,,1)=$A42),INDEX(base_indices,,),0)))","v":123.3},{"$f":"IF(A42>date,\"\",SUM(IF((INDEX(base_indices,1,)=F$13)*(INDEX(base_indices,,1)=$A42),INDEX(base_indices,,),0)))","v":109.6},{"$f":"IF(A42>date,\"\",IF(OR(G$13=\"\",G$13=\"Fioul lourd\"),#N/A,SUM(IF((INDEX(base_indices,1,)=G$13)*(INDEX(base_indices,,1)=$A42),INDEX(base_indices,,),0))))","v":105.9},{"$f":"IF(A42>date,\"\",IF(OR(H$13=\"\",H$13=\"Fioul lourd\"),#N/A,SUM(IF((INDEX(base_indices,1,)=H$13)*(INDEX(base_indices,,1)=$A42),INDEX(base_indices,,),0))))","v":139.19999999999999}]
["2021-03-01",{"$f":"IF(A43>date,\"\",SUM(IF((INDEX(base_index,1,)=B$13)*(INDEX(base_index,,1)=$A43),INDEX(base_index,,),0)))","v":113.5},{"$f":"IF(A43>date,\"\",IF((SUM(IF((INDEX(base_index,1,)=C$13)*(INDEX(base_index,,1)=$A43),INDEX(base_index,,),0)))=0,#N/A,SUM(IF((INDEX(base_index,1,)=C$13)*(INDEX(base_index,,1)=$A43),INDEX(base_index,,),0))))","v":118.3},{"$f":"IF(A43>date,\"\",SUM(IF((INDEX(base_indices,1,)=D$13)*(INDEX(base_indices,,1)=$A43),INDEX(base_indices,,),0)))","v":107.6},{"$f":"IF(A43>date,\"\",SUM(IF((INDEX(base_indices,1,)=E$13)*(INDEX(base_indices,,1)=$A43),INDEX(base_indices,,),0)))","v":123.3},{"$f":"IF(A43>date,\"\",SUM(IF((INDEX(base_indices,1,)=F$13)*(INDEX(base_indices,,1)=$A43),INDEX(base_indices,,),0)))","v":111.5},{"$f":"IF(A43>date,\"\",IF(OR(G$13=\"\",G$13=\"Fioul lourd\"),#N/A,SUM(IF((INDEX(base_indices,1,)=G$13)*(INDEX(base_indices,,1)=$A43),INDEX(base_indices,,),0))))","v":106.2},{"$f":"IF(A43>date,\"\",IF(OR(H$13=\"\",H$13=\"Fioul lourd\"),#N/A,SUM(IF((INDEX(base_indices,1,)=H$13)*(INDEX(base_indices,,1)=$A43),INDEX(base_indices,,),0))))","v":144.6}]
["2021-04-01",{"$f":"IF(A44>date,\"\",SUM(IF((INDEX(base_index,1,)=B$13)*(INDEX(base_index,,1)=$A44),INDEX(base_index,,),0)))","v":113.8},{"$f":"IF(A44>date,\"\",IF((SUM(IF((INDEX(base_index,1,)=C$13)*(INDEX(base_index,,1)=$A44),INDEX(base_index,,),0)))=0,#N/A,SUM(IF((INDEX(base_index,1,)=C$13)*(INDEX(base_index,,1)=$A44),INDEX(base_index,,),0))))","v":118.9},{"$f":"IF(A44>date,\"\",SUM(IF((INDEX(base_indices,1,)=D$13)*(INDEX(base_indices,,1)=$A44),INDEX(base_indices,,),0)))","v":107.8},{"$f":"IF(A44>date,\"\",SUM(IF((INDEX(base_indices,1,)=E$13)*(INDEX(base_indices,,1)=$A44),INDEX(base_indices,,),0)))","v":123},{"$f":"IF(A44>date,\"\",SUM(IF((INDEX(base_indices,1,)=F$13)*(INDEX(base_indices,,1)=$A44),INDEX(base_indices,,),0)))","v":110.9},{"$f":"IF(A44>date,\"\",IF(OR(G$13=\"\",G$13=\"Fioul lourd\"),#N/A,SUM(IF((INDEX(base_indices,1,)=G$13)*(INDEX(base_indices,,1)=$A44),INDEX(base_indices,,),0))))","v":106.4},{"$f":"IF(A44>date,\"\",IF(OR(H$13=\"\",H$13=\"Fioul lourd\"),#N/A,SUM(IF((INDEX(base_indices,1,)=H$13)*(INDEX(base_indices,,1)=$A44),INDEX(base_indices,,),0))))","v":149.4}]
["2021-05-01",{"$f":"IF(A45>date,\"\",SUM(IF((INDEX(base_index,1,)=B$13)*(INDEX(base_index,,1)=$A45),INDEX(base_index,,),0)))","v":114},{"$f":"IF(A45>date,\"\",IF((SUM(IF((INDEX(base_index,1,)=C$13)*(INDEX(base_index,,1)=$A45),INDEX(base_index,,),0)))=0,#N/A,SUM(IF((INDEX(base_index,1,)=C$13)*(INDEX(base_index,,1)=$A45),INDEX(base_index,,),0))))","v":119},{"$f":"IF(A45>date,\"\",SUM(IF((INDEX(base_indices,1,)=D$13)*(INDEX(base_indices,,1)=$A45),INDEX(base_indices,,),0)))","v":107.2},{"$f":"IF(A45>date,\"\",SUM(IF((INDEX(base_indices,1,)=E$13)*(INDEX(base_indices,,1)=$A45),INDEX(base_indices,,),0)))","v":122.7},{"$f":"IF(A45>date,\"\",SUM(IF((INDEX(base_indices,1,)=F$13)*(INDEX(base_indices,,1)=$A45),INDEX(base_indices,,),0)))","v":112.9},{"$f":"IF(A45>date,\"\",IF(OR(G$13=\"\",G$13=\"Fioul lourd\"),#N/A,SUM(IF((INDEX(base_indices,1,)=G$13)*(INDEX(base_indices,,1)=$A45),INDEX(base_indices,,),0))))","v":106},{"$f":"IF(A45>date,\"\",IF(OR(H$13=\"\",H$13=\"Fioul lourd\"),#N/A,SUM(IF((INDEX(base_indices,1,)=H$13)*(INDEX(base_indices,,1)=$A45),INDEX(base_indices,,),0))))","v":153.5}]
["2021-06-01",{"$f":"IF(A46>date,\"\",SUM(IF((INDEX(base_index,1,)=B$13)*(INDEX(base_index,,1)=$A46),INDEX(base_index,,),0)))","v":114.8},{"$f":"IF(A46>date,\"\",IF((SUM(IF((INDEX(base_index,1,)=C$13)*(INDEX(base_index,,1)=$A46),INDEX(base_index,,),0)))=0,#N/A,SUM(IF((INDEX(base_index,1,)=C$13)*(INDEX(base_index,,1)=$A46),INDEX(base_index,,),0))))","v":120.8},{"$f":"IF(A46>date,\"\",SUM(IF((INDEX(base_indices,1,)=D$13)*(INDEX(base_indices,,1)=$A46),INDEX(base_indices,,),0)))","v":107.8},{"$f":"IF(A46>date,\"\",SUM(IF((INDEX(base_indices,1,)=E$13)*(INDEX(base_indices,,1)=$A46),INDEX(base_indices,,),0)))","v":122.5},{"$f":"IF(A46>date,\"\",SUM(IF((INDEX(base_indices,1,)=F$13)*(INDEX(base_indices,,1)=$A46),INDEX(base_indices,,),0)))","v":117.1},{"$f":"IF(A46>date,\"\",IF(OR(G$13=\"\",G$13=\"Fioul lourd\"),#N/A,SUM(IF((INDEX(base_indices,1,)=G$13)*(INDEX(base_indices,,1)=$A46),INDEX(base_indices,,),0))))","v":105.6},{"$f":"IF(A46>date,\"\",IF(OR(H$13=\"\",H$13=\"Fioul lourd\"),#N/A,SUM(IF((INDEX(base_indices,1,)=H$13)*(INDEX(base_indices,,1)=$A46),INDEX(base_indices,,),0))))","v":167.7}]
["2021-07-01",{"$f":"IF(A47>date,\"\",SUM(IF((INDEX(base_index,1,)=B$13)*(INDEX(base_index,,1)=$A47),INDEX(base_index,,),0)))","v":115.9},{"$f":"IF(A47>date,\"\",IF((SUM(IF((INDEX(base_index,1,)=C$13)*(INDEX(base_index,,1)=$A47),INDEX(base_index,,),0)))=0,#N/A,SUM(IF((INDEX(base_index,1,)=C$13)*(INDEX(base_index,,1)=$A47),INDEX(base_index,,),0))))","v":122.7},{"$f":"IF(A47>date,\"\",SUM(IF((INDEX(base_indices,1,)=D$13)*(INDEX(base_indices,,1)=$A47),INDEX(base_indices,,),0)))","v":108.3},{"$f":"IF(A47>date,\"\",SUM(IF((INDEX(base_indices,1,)=E$13)*(INDEX(base_indices,,1)=$A47),INDEX(base_indices,,),0)))","v":122.5},{"$f":"IF(A47>date,\"\",SUM(IF((INDEX(base_indices,1,)=F$13)*(INDEX(base_indices,,1)=$A47),INDEX(base_indices,,),0)))","v":120.9},{"$f":"IF(A47>date,\"\",IF(OR(G$13=\"\",G$13=\"Fioul lourd\"),#N/A,SUM(IF((INDEX(base_indices,1,)=G$13)*(INDEX(base_indices,,1)=$A47),INDEX(base_indices,,),0))))","v":106.7},{"$f":"IF(A47>date,\"\",IF(OR(H$13=\"\",H$13=\"Fioul lourd\"),#N/A,SUM(IF((INDEX(base_indices,1,)=H$13)*(INDEX(base_indices,,1)=$A47),INDEX(base_indices,,),0))))","v":185.7}]
["2021-08-01",{"$f":"IF(A48>date,\"\",SUM(IF((INDEX(base_index,1,)=B$13)*(INDEX(base_index,,1)=$A48),INDEX(base_index,,),0)))","v":116.1},{"$f":"IF(A48>date,\"\",IF((SUM(IF((INDEX(base_index,1,)=C$13)*(INDEX(base_index,,1)=$A48),INDEX(base_index,,),0)))=0,#N/A,SUM(IF((INDEX(base_index,1,)=C$13)*(INDEX(base_index,,1)=$A48),INDEX(base_index,,),0))))","v":123.1},{"$f":"IF(A48>date,\"\",SUM(IF((INDEX(base_indices,1,)=D$13)*(INDEX(base_indices,,1)=$A48),INDEX(base_indices,,),0)))","v":108.2},{"$f":"IF(A48>date,\"\",SUM(IF((INDEX(base_indices,1,)=E$13)*(INDEX(base_indices,,1)=$A48),INDEX(base_indices,,),0)))","v":122.6},{"$f":"IF(A48>date,\"\",SUM(IF((INDEX(base_indices,1,)=F$13)*(INDEX(base_indices,,1)=$A48),INDEX(base_indices,,),0)))","v":122.5},{"$f":"IF(A48>date,\"\",IF(OR(G$13=\"\",G$13=\"Fioul lourd\"),#N/A,SUM(IF((INDEX(base_indices,1,)=G$13)*(INDEX(base_indices,,1)=$A48),INDEX(base_indices,,),0))))","v":108.3},{"$f":"IF(A48>date,\"\",IF(OR(H$13=\"\",H$13=\"Fioul lourd\"),#N/A,SUM(IF((INDEX(base_indices,1,)=H$13)*(INDEX(base_indices,,1)=$A48),INDEX(base_indices,,),0))))","v":191.7}]
["2021-09-01",{"$f":"IF(A49>date,\"\",SUM(IF((INDEX(base_index,1,)=B$13)*(INDEX(base_index,,1)=$A49),INDEX(base_index,,),0)))","v":116.4},{"$f":"IF(A49>date,\"\",IF((SUM(IF((INDEX(base_index,1,)=C$13)*(INDEX(base_index,,1)=$A49),INDEX(base_index,,),0)))=0,#N/A,SUM(IF((INDEX(base_index,1,)=C$13)*(INDEX(base_index,,1)=$A49),INDEX(base_index,,),0))))","v":123.7},{"$f":"IF(A49>date,\"\",SUM(IF((INDEX(base_indices,1,)=D$13)*(INDEX(base_indices,,1)=$A49),INDEX(base_indices,,),0)))","v":108.6},{"$f":"IF(A49>date,\"\",SUM(IF((INDEX(base_indices,1,)=E$13)*(INDEX(base_indices,,1)=$A49),INDEX(base_indices,,),0)))","v":122.7},{"$f":"IF(A49>date,\"\",SUM(IF((INDEX(base_indices,1,)=F$13)*(INDEX(base_indices,,1)=$A49),INDEX(base_indices,,),0)))","v":123.3},{"$f":"IF(A49>date,\"\",IF(OR(G$13=\"\",G$13=\"Fioul lourd\"),#N/A,SUM(IF((INDEX(base_indices,1,)=G$13)*(INDEX(base_indices,,1)=$A49),INDEX(base_indices,,),0))))","v":105.5},{"$f":"IF(A49>date,\"\",IF(OR(H$13=\"\",H$13=\"Fioul lourd\"),#N/A,SUM(IF((INDEX(base_indices,1,)=H$13)*(INDEX(base_indices,,1)=$A49),INDEX(base_indices,,),0))))","v":196.7}]
["2021-10-01",{"$f":"IF(A50>date,\"\",SUM(IF((INDEX(base_index,1,)=B$13)*(INDEX(base_index,,1)=$A50),INDEX(base_index,,),0)))","v":117.5},{"$f":"IF(A50>date,\"\",IF((SUM(IF((INDEX(base_index,1,)=C$13)*(INDEX(base_index,,1)=$A50),INDEX(base_index,,),0)))=0,#N/A,SUM(IF((INDEX(base_index,1,)=C$13)*(INDEX(base_index,,1)=$A50),INDEX(base_index,,),0))))","v":123.6},{"$f":"IF(A50>date,\"\",SUM(IF((INDEX(base_indices,1,)=D$13)*(INDEX(base_indices,,1)=$A50),INDEX(base_indices,,),0)))","v":109},{"$f":"IF(A50>date,\"\",SUM(IF((INDEX(base_indices,1,)=E$13)*(INDEX(base_indices,,1)=$A50),INDEX(base_indices,,),0)))","v":122.7},{"$f":"IF(A50>date,\"\",SUM(IF((INDEX(base_indices,1,)=F$13)*(INDEX(base_indices,,1)=$A50),INDEX(base_indices,,),0)))","v":133},{"$f":"IF(A50>date,\"\",IF(OR(G$13=\"\",G$13=\"Fioul lourd\"),#N/A,SUM(IF((INDEX(base_indices,1,)=G$13)*(INDEX(base_indices,,1)=$A50),INDEX(base_indices,,),0))))","v":106.4},{"$f":"IF(A50>date,\"\",IF(OR(H$13=\"\",H$13=\"Fioul lourd\"),#N/A,SUM(IF((INDEX(base_indices,1,)=H$13)*(INDEX(base_indices,,1)=$A50),INDEX(base_indices,,),0))))","v":193}]
[]
[{"$f":"'Résultats 3-6 mois glissants'!B4","v":"TP02"}]
[]
[{"$f":"OFFSET('Composition index'!$J$2,0,I54)","v":"Travail activités spécialisées"},{"$f":"SUM(IF((INDEX(compo,2,)='Données 3-6 mois glissants'!A54)*(INDEX(compo,,1)=$A$52),INDEX(compo,,),0))","v":0},{"$f":"_xlfn._xlws.SORT(A54:B88,2,-1)","v":"Béton prêt à l'emploi"},0.12,{"$f":"HLOOKUP(C54,'Composition index'!$A$2:$AR$3,2,FALSE)","v":"010534646"},{"$f":"SUM(IF((INDEX(base_indices,1,)=E54)*(INDEX(base_indices,,1)>=$B$1)*(INDEX(base_indices,,1)<=$C$1),INDEX(base_indices,,),0))/SUM(IF((INDEX(base_indices,1,)=E54)*(INDEX(base_indices,,1)>=$D$1)*(INDEX(base_indices,,1)<=$E$1),INDEX(base_indices,,),0))-1","v":5.969211435752575E-3},{"$f":"SUM(IF((INDEX(base_indices,1,)=E54)*(INDEX(base_indices,,1)>=$B$3)*(INDEX(base_indices,,1)<=$C$3),INDEX(base_indices,,),0))/SUM(IF((INDEX(base_indices,1,)=E54)*(INDEX(base_indices,,1)>=$D$3)*(INDEX(base_indices,,1)<=$E$3),INDEX(base_indices,,),0))-1","v":6.4627994955861467E-3},{"$f":"INDEX('Indice prix'!$B$1:$AP$2,1,MATCH('Données cumul depuis janvier'!E54,'Indice prix'!$B$2:$AP$2,0))","v":"base 2015"},null,{"$f":"IF(D54=0,\"\",\"base 100 en \"&RIGHT(H54,4))","v":"base 100 en 2015"}]
[{"$f":"OFFSET('Composition index'!$J$2,0,I55)","v":"Électricité vendue aux entreprises consommatrices finales"},{"$f":"SUM(IF((INDEX(compo,2,)='Données 3-6 mois glissants'!A55)*(INDEX(compo,,1)=$A$52),INDEX(compo,,),0))","v":0.01},"Barres crénelées ou nervurées pour béton armé",0.09,{"$f":"HLOOKUP(C55,'Composition index'!$A$2:$AR$3,2,FALSE)","v":"010546545"},{"$f":"SUM(IF((INDEX(base_indices,1,)=E55)*(INDEX(base_indices,,1)>=$B$1)*(INDEX(base_indices,,1)<=$C$1),INDEX(base_indices,,),0))/SUM(IF((INDEX(base_indices,1,)=E55)*(INDEX(base_indices,,1)>=$D$1)*(INDEX(base_indices,,1)<=$E$1),INDEX(base_indices,,),0))-1","v":0.14697178930755572},{"$f":"SUM(IF((INDEX(base_indices,1,)=E55)*(INDEX(base_indices,,1)>=$B$3)*(INDEX(base_indices,,1)<=$C$3),INDEX(base_indices,,),0))/SUM(IF((INDEX(base_indices,1,)=E55)*(INDEX(base_indices,,1)>=$D$3)*(INDEX(base_indices,,1)<=$E$3),INDEX(base_indices,,),0))-1","v":0.37290273747950042},{"$f":"INDEX('Indice prix'!$B$1:$AP$2,1,MATCH('Données cumul depuis janvier'!E55,'Indice prix'!$B$2:$AP$2,0))","v":"base 2015"},1,{"$f":"IF(D55=0,\"\",\"base 100 en \"&RIGHT(H55,4))","v":"base 100 en 2015"}]
[{"$f":"OFFSET('Composition index'!$J$2,0,I56)","v":"Fioul lourd"},{"$f":"SUM(IF((INDEX(compo,2,)='Données 3-6 mois glissants'!A56)*(INDEX(compo,,1)=$A$52),INDEX(compo,,),0))","v":0},"Tubes, tuyaux en matière plastique",0.04,{"$f":"HLOOKUP(C56,'Composition index'!$A$2:$AR$3,2,FALSE)","v":"010534207"},{"$f":"SUM(IF((INDEX(base_indices,1,)=E56)*(INDEX(base_indices,,1)>=$B$1)*(INDEX(base_indices,,1)<=$C$1),INDEX(base_indices,,),0))/SUM(IF((INDEX(base_indices,1,)=E56)*(INDEX(base_indices,,1)>=$D$1)*(INDEX(base_indices,,1)<=$E$1),INDEX(base_indices,,),0))-1","v":7.8334304018637058E-2},{"$f":"SUM(IF((INDEX(base_indices,1,)=E56)*(INDEX(base_indices,,1)>=$B$3)*(INDEX(base_indices,,1)<=$C$3),INDEX(base_indices,,),0))/SUM(IF((INDEX(base_indices,1,)=E56)*(INDEX(base_indices,,1)>=$D$3)*(INDEX(base_indices,,1)<=$E$3),INDEX(base_indices,,),0))-1","v":0.18397478433974768},null,2]
[{"$f":"OFFSET('Composition index'!$J$2,0,I57)","v":"Gazole routier HTT"},{"$f":"SUM(IF((INDEX(compo,2,)='Données 3-6 mois glissants'!A57)*(INDEX(compo,,1)=$A$52),INDEX(compo,,),0))","v":0},"Ensemble des produits du sciage",0.02,{"$f":"HLOOKUP(C57,'Composition index'!$A$2:$AR$3,2,FALSE)","v":"010534575"},{"$f":"SUM(IF((INDEX(base_indices,1,)=E57)*(INDEX(base_indices,,1)>=$B$1)*(INDEX(base_indices,,1)<=$C$1),INDEX(base_indices,,),0))/SUM(IF((INDEX(base_indices,1,)=E57)*(INDEX(base_indices,,1)>=$D$1)*(INDEX(base_indices,,1)<=$E$1),INDEX(base_indices,,),0))-1","v":7.1614583333333259E-2},{"$f":"SUM(IF((INDEX(base_indices,1,)=E57)*(INDEX(base_indices,,1)>=$B$3)*(INDEX(base_indices,,1)<=$C$3),INDEX(base_indices,,),0))/SUM(IF((INDEX(base_indices,1,)=E57)*(INDEX(base_indices,,1)>=$D$3)*(INDEX(base_indices,,1)<=$E$3),INDEX(base_indices,,),0))-1","v":0.16199240432369266},null,3]
[{"$f":"OFFSET('Composition index'!$J$2,0,I58)","v":"Tubes, tuyaux en matière plastique"},{"$f":"SUM(IF((INDEX(compo,2,)='Données 3-6 mois glissants'!A58)*(INDEX(compo,,1)=$A$52),INDEX(compo,,),0))","v":0.04},"Électricité vendue aux entreprises consommatrices finales",0.01,{"$f":"HLOOKUP(C58,'Composition index'!$A$2:$AR$3,2,FALSE)","v":"010534769"},{"$f":"SUM(IF((INDEX(base_indices,1,)=E58)*(INDEX(base_indices,,1)>=$B$1)*(INDEX(base_indices,,1)<=$C$1),INDEX(base_indices,,),0))/SUM(IF((INDEX(base_indices,1,)=E58)*(INDEX(base_indices,,1)>=$D$1)*(INDEX(base_indices,,1)<=$E$1),INDEX(base_indices,,),0))-1","v":-2.1034180543383019E-2},{"$f":"SUM(IF((INDEX(base_indices,1,)=E58)*(INDEX(base_indices,,1)>=$B$3)*(INDEX(base_indices,,1)<=$C$3),INDEX(base_indices,,),0))/SUM(IF((INDEX(base_indices,1,)=E58)*(INDEX(base_indices,,1)>=$D$3)*(INDEX(base_indices,,1)<=$E$3),INDEX(base_indices,,),0))-1","v":-0.13398107900792633},null,4]
[{"$f":"OFFSET('Composition index'!$J$2,0,I59)","v":"Ensemble des produits du sciage"},{"$f":"SUM(IF((INDEX(compo,2,)='Données 3-6 mois glissants'!A59)*(INDEX(compo,,1)=$A$52),INDEX(compo,,),0))","v":0.02},"Travail activités spécialisées",0,{"$f":"HLOOKUP(C59,'Composition index'!$A$2:$AR$3,2,FALSE)","v":"001565195"},{"$f":"SUM(IF((INDEX(base_indices,1,)=E59)*(INDEX(base_indices,,1)>=$B$1)*(INDEX(base_indices,,1)<=$C$1),INDEX(base_indices,,),0))/SUM(IF((INDEX(base_indices,1,)=E59)*(INDEX(base_indices,,1)>=$D$1)*(INDEX(base_indices,,1)<=$E$1),INDEX(base_indices,,),0))-1","v":-2.7070925825667391E-4},{"$f":"SUM(IF((INDEX(base_indices,1,)=E59)*(INDEX(base_indices,,1)>=$B$3)*(INDEX(base_indices,,1)<=$C$3),INDEX(base_indices,,),0))/SUM(IF((INDEX(base_indices,1,)=E59)*(INDEX(base_indices,,1)>=$D$3)*(INDEX(base_indices,,1)<=$E$3),INDEX(base_indices,,),0))-1","v":-3.6417588346372431E-3},null,5]
[{"$f":"OFFSET('Composition index'!$J$2,0,I60)","v":"Béton prêt à l'emploi"},{"$f":"SUM(IF((INDEX(compo,2,)='Données 3-6 mois glissants'!A60)*(INDEX(compo,,1)=$A$52),INDEX(compo,,),0))","v":0.12},"Fioul lourd",0,{"$f":"HLOOKUP(C60,'Composition index'!$A$2:$AR$3,2,FALSE)","v":"Fioul lourd"},{"$f":"SUM(IF((INDEX(base_indices,1,)=E60)*(INDEX(base_indices,,1)>=$B$1)*(INDEX(base_indices,,1)<=$C$1),INDEX(base_indices,,),0))/SUM(IF((INDEX(base_indices,1,)=E60)*(INDEX(base_indices,,1)>=$D$1)*(INDEX(base_indices,,1)<=$E$1),INDEX(base_indices,,),0))-1","v":7.7335218075283318E-2},{"$f":"SUM(IF((INDEX(base_indices,1,)=E60)*(INDEX(base_indices,,1)>=$B$3)*(INDEX(base_indices,,1)<=$C$3),INDEX(base_indices,,),0))/SUM(IF((INDEX(base_indices,1,)=E60)*(INDEX(base_indices,,1)>=$D$3)*(INDEX(base_indices,,1)<=$E$3),INDEX(base_indices,,),0))-1","v":0.14894596307166563},null,6]
[{"$f":"OFFSET('Composition index'!$J$2,0,I61)","v":"Barres crénelées ou nervurées pour béton armé"},{"$f":"SUM(IF((INDEX(compo,2,)='Données 3-6 mois glissants'!A61)*(INDEX(compo,,1)=$A$52),INDEX(compo,,),0))","v":0.09},"Gazole routier HTT",0,{"$f":"HLOOKUP(C61,'Composition index'!$A$2:$AR$3,2,FALSE)","v":"Gazole routier HTT"},{"$f":"SUM(IF((INDEX(base_indices,1,)=E61)*(INDEX(base_indices,,1)>=$B$1)*(INDEX(base_indices,,1)<=$C$1),INDEX(base_indices,,),0))/SUM(IF((INDEX(base_indices,1,)=E61)*(INDEX(base_indices,,1)>=$D$1)*(INDEX(base_indices,,1)<=$E$1),INDEX(base_indices,,),0))-1","v":8.987882897169519E-2},{"$f":"SUM(IF((INDEX(base_indices,1,)=E61)*(INDEX(base_indices,,1)>=$B$3)*(INDEX(base_indices,,1)<=$C$3),INDEX(base_indices,,),0))/SUM(IF((INDEX(base_indices,1,)=E61)*(INDEX(base_indices,,1)>=$D$3)*(INDEX(base_indices,,1)<=$E$3),INDEX(base_indices,,),0))-1","v":0.15588366430369271},null,7]
[{"$f":"OFFSET('Composition index'!$J$2,0,I62)","v":"Sables et granulats"},{"$f":"SUM(IF((INDEX(compo,2,)='Données 3-6 mois glissants'!A62)*(INDEX(compo,,1)=$A$52),INDEX(compo,,),0))","v":0},"Sables et granulats",0,{"$f":"HLOOKUP(C62,'Composition index'!$A$2:$AR$3,2,FALSE)","v":"010536067"},{"$f":"SUM(IF((INDEX(base_indices,1,)=E62)*(INDEX(base_indices,,1)>=$B$1)*(INDEX(base_indices,,1)<=$C$1),INDEX(base_indices,,),0))/SUM(IF((INDEX(base_indices,1,)=E62)*(INDEX(base_indices,,1)>=$D$1)*(INDEX(base_indices,,1)<=$E$1),INDEX(base_indices,,),0))-1","v":1.9212295869357465E-3},{"$f":"SUM(IF((INDEX(base_indices,1,)=E62)*(INDEX(base_indices,,1)>=$B$3)*(INDEX(base_indices,,1)<=$C$3),INDEX(base_indices,,),0))/SUM(IF((INDEX(base_indices,1,)=E62)*(INDEX(base_indices,,1)>=$D$3)*(INDEX(base_indices,,1)<=$E$3),INDEX(base_indices,,),0))-1","v":5.3063193439459866E-3},null,8]
[{"$f":"OFFSET('Composition index'!$J$2,0,I63)","v":"Plaques, feuilles, tubes et profilés en matières plastiques"},{"$f":"SUM(IF((INDEX(compo,2,)='Données 3-6 mois glissants'!A63)*(INDEX(compo,,1)=$A$52),INDEX(compo,,),0))","v":0},"Plaques, feuilles, tubes et profilés en matières plastiques",0,{"$f":"HLOOKUP(C63,'Composition index'!$A$2:$AR$3,2,FALSE)","v":"010534625"},{"$f":"SUM(IF((INDEX(base_indices,1,)=E63)*(INDEX(base_indices,,1)>=$B$1)*(INDEX(base_indices,,1)<=$C$1),INDEX(base_indices,,),0))/SUM(IF((INDEX(base_indices,1,)=E63)*(INDEX(base_indices,,1)>=$D$1)*(INDEX(base_indices,,1)<=$E$1),INDEX(base_indices,,),0))-1","v":4.5794930875576068E-2},{"$f":"SUM(IF((INDEX(base_indices,1,)=E63)*(INDEX(base_indices,,1)>=$B$3)*(INDEX(base_indices,,1)<=$C$3),INDEX(base_indices,,),0))/SUM(IF((INDEX(base_indices,1,)=E63)*(INDEX(base_indices,,1)>=$D$3)*(INDEX(base_indices,,1)<=$E$3),INDEX(base_indices,,),0))-1","v":0.19237871411784435},null,9]
[{"$f":"OFFSET('Composition index'!$J$2,0,I64)","v":"Ciment, chaux et plâtre"},{"$f":"SUM(IF((INDEX(compo,2,)='Données 3-6 mois glissants'!A64)*(INDEX(compo,,1)=$A$52),INDEX(compo,,),0))","v":0},"Ciment, chaux et plâtre",0,{"$f":"HLOOKUP(C64,'Composition index'!$A$2:$AR$3,2,FALSE)","v":"010534642"},{"$f":"SUM(IF((INDEX(base_indices,1,)=E64)*(INDEX(base_indices,,1)>=$B$1)*(INDEX(base_indices,,1)<=$C$1),INDEX(base_indices,,),0))/SUM(IF((INDEX(base_indices,1,)=E64)*(INDEX(base_indices,,1)>=$D$1)*(INDEX(base_indices,,1)<=$E$1),INDEX(base_indices,,),0))-1","v":2.0231213872832443E-2},{"$f":"SUM(IF((INDEX(base_indices,1,)=E64)*(INDEX(base_indices,,1)>=$B$3)*(INDEX(base_indices,,1)<=$C$3),INDEX(base_indices,,),0))/SUM(IF((INDEX(base_indices,1,)=E64)*(INDEX(base_indices,,1)>=$D$3)*(INDEX(base_indices,,1)<=$E$3),INDEX(base_indices,,),0))-1","v":5.7553956834532904E-3},null,10]
[{"$f":"OFFSET('Composition index'!$J$2,0,I65)","v":"Produits explosifs"},{"$f":"SUM(IF((INDEX(compo,2,)='Données 3-6 mois glissants'!A65)*(INDEX(compo,,1)=$A$52),INDEX(compo,,),0))","v":0},"Produits explosifs",0,{"$f":"HLOOKUP(C65,'Composition index'!$A$2:$AR$3,2,FALSE)","v":"010534614"},{"$f":"SUM(IF((INDEX(base_indices,1,)=E65)*(INDEX(base_indices,,1)>=$B$1)*(INDEX(base_indices,,1)<=$C$1),INDEX(base_indices,,),0))/SUM(IF((INDEX(base_indices,1,)=E65)*(INDEX(base_indices,,1)>=$D$1)*(INDEX(base_indices,,1)<=$E$1),INDEX(base_indices,,),0))-1","v":6.3877355477481856E-4},{"$f":"SUM(IF((INDEX(base_indices,1,)=E65)*(INDEX(base_indices,,1)>=$B$3)*(INDEX(base_indices,,1)<=$C$3),INDEX(base_indices,,),0))/SUM(IF((INDEX(base_indices,1,)=E65)*(INDEX(base_indices,,1)>=$D$3)*(INDEX(base_indices,,1)<=$E$3),INDEX(base_indices,,),0))-1","v":7.8841512469831621E-3},null,11]
[{"$f":"OFFSET('Composition index'!$J$2,0,I66)","v":"Acier pour la construction"},{"$f":"SUM(IF((INDEX(compo,2,)='Données 3-6 mois glissants'!A66)*(INDEX(compo,,1)=$A$52),INDEX(compo,,),0))","v":0},"Acier pour la construction",0,{"$f":"HLOOKUP(C66,'Composition index'!$A$2:$AR$3,2,FALSE)","v":"010536462"},{"$f":"SUM(IF((INDEX(base_indices,1,)=E66)*(INDEX(base_indices,,1)>=$B$1)*(INDEX(base_indices,,1)<=$C$1),INDEX(base_indices,,),0))/SUM(IF((INDEX(base_indices,1,)=E66)*(INDEX(base_indices,,1)>=$D$1)*(INDEX(base_indices,,1)<=$E$1),INDEX(base_indices,,),0))-1","v":0.17116564417177926},{"$f":"SUM(IF((INDEX(base_indices,1,)=E66)*(INDEX(base_indices,,1)>=$B$3)*(INDEX(base_indices,,1)<=$C$3),INDEX(base_indices,,),0))/SUM(IF((INDEX(base_indices,1,)=E66)*(INDEX(base_indices,,1)>=$D$3)*(INDEX(base_indices,,1)<=$E$3),INDEX(base_indices,,),0))-1","v":0.39184583114840055},null,12]
[{"$f":"OFFSET('Composition index'!$J$2,0,I67)","v":"Bitume"},{"$f":"SUM(IF((INDEX(compo,2,)='Données 3-6 mois glissants'!A67)*(INDEX(compo,,1)=$A$52),INDEX(compo,,),0))","v":0},"Bitume",0,{"$f":"HLOOKUP(C67,'Composition index'!$A$2:$AR$3,2,FALSE)","v":"010534598"},{"$f":"SUM(IF((INDEX(base_indices,1,)=E67)*(INDEX(base_indices,,1)>=$B$1)*(INDEX(base_indices,,1)<=$C$1),INDEX(base_indices,,),0))/SUM(IF((INDEX(base_indices,1,)=E67)*(INDEX(base_indices,,1)>=$D$1)*(INDEX(base_indices,,1)<=$E$1),INDEX(base_indices,,),0))-1","v":9.8974680895584921E-2},{"$f":"SUM(IF((INDEX(base_indices,1,)=E67)*(INDEX(base_indices,,1)>=$B$3)*(INDEX(base_indices,,1)<=$C$3),INDEX(base_indices,,),0))/SUM(IF((INDEX(base_indices,1,)=E67)*(INDEX(base_indices,,1)>=$D$3)*(INDEX(base_indices,,1)<=$E$3),INDEX(base_indices,,),0))-1","v":0.18963472485768484},null,13]
[{"$f":"OFFSET('Composition index'!$J$2,0,I68)","v":"Produits de voierie en béton"},{"$f":"SUM(IF((INDEX(compo,2,)='Données 3-6 mois glissants'!A68)*(INDEX(compo,,1)=$A$52),INDEX(compo,,),0))","v":0},"Produits de voierie en béton",0,{"$f":"HLOOKUP(C68,'Composition index'!$A$2:$AR$3,2,FALSE)","v":"010534252"},{"$f":"SUM(IF((INDEX(base_indices,1,)=E68)*(INDEX(base_indices,,1)>=$B$1)*(INDEX(base_indices,,1)<=$C$1),INDEX(base_indices,,),0))/SUM(IF((INDEX(base_indices,1,)=E68)*(INDEX(base_indices,,1)>=$D$1)*(INDEX(base_indices,,1)<=$E$1),INDEX(base_indices,,),0))-1","v":2.0036991368680646E-2},{"$f":"SUM(IF((INDEX(base_indices,1,)=E68)*(INDEX(base_indices,,1)>=$B$3)*(INDEX(base_indices,,1)<=$C$3),INDEX(base_indices,,),0))/SUM(IF((INDEX(base_indices,1,)=E68)*(INDEX(base_indices,,1)>=$D$3)*(INDEX(base_indices,,1)<=$E$3),INDEX(base_indices,,),0))-1","v":1.8337218337218353E-2},null,14]
[{"$f":"OFFSET('Composition index'!$J$2,0,I69)","v":"Mortiers et bétons secs"},{"$f":"SUM(IF((INDEX(compo,2,)='Données 3-6 mois glissants'!A69)*(INDEX(compo,,1)=$A$52),INDEX(compo,,),0))","v":0},"Mortiers et bétons secs",0,{"$f":"HLOOKUP(C69,'Composition index'!$A$2:$AR$3,2,FALSE)","v":"010534647"},{"$f":"SUM(IF((INDEX(base_indices,1,)=E69)*(INDEX(base_indices,,1)>=$B$1)*(INDEX(base_indices,,1)<=$C$1),INDEX(base_indices,,),0))/SUM(IF((INDEX(base_indices,1,)=E69)*(INDEX(base_indices,,1)>=$D$1)*(INDEX(base_indices,,1)<=$E$1),INDEX(base_indices,,),0))-1","v":1.051939513477973E-2},{"$f":"SUM(IF((INDEX(base_indices,1,)=E69)*(INDEX(base_indices,,1)>=$B$3)*(INDEX(base_indices,,1)<=$C$3),INDEX(base_indices,,),0))/SUM(IF((INDEX(base_indices,1,)=E69)*(INDEX(base_indices,,1)>=$D$3)*(INDEX(base_indices,,1)<=$E$3),INDEX(base_indices,,),0))-1","v":1.6622340425531901E-2},null,15]
[{"$f":"OFFSET('Composition index'!$J$2,0,I70)","v":"Travaux de fonderie de fonte"},{"$f":"SUM(IF((INDEX(compo,2,)='Données 3-6 mois glissants'!A70)*(INDEX(compo,,1)=$A$52),INDEX(compo,,),0))","v":0},"Travaux de fonderie de fonte",0,{"$f":"HLOOKUP(C70,'Composition index'!$A$2:$AR$3,2,FALSE)","v":"010534662"},{"$f":"SUM(IF((INDEX(base_indices,1,)=E70)*(INDEX(base_indices,,1)>=$B$1)*(INDEX(base_indices,,1)<=$C$1),INDEX(base_indices,,),0))/SUM(IF((INDEX(base_indices,1,)=E70)*(INDEX(base_indices,,1)>=$D$1)*(INDEX(base_indices,,1)<=$E$1),INDEX(base_indices,,),0))-1","v":4.1233657391887446E-2},{"$f":"SUM(IF((INDEX(base_indices,1,)=E70)*(INDEX(base_indices,,1)>=$B$3)*(INDEX(base_indices,,1)<=$C$3),INDEX(base_indices,,),0))/SUM(IF((INDEX(base_indices,1,)=E70)*(INDEX(base_indices,,1)>=$D$3)*(INDEX(base_indices,,1)<=$E$3),INDEX(base_indices,,),0))-1","v":7.0311126735805862E-2},null,16]
[{"$f":"OFFSET('Composition index'!$J$2,0,I71)","v":"Tuiles, briques et produits de construction en terre cuite"},{"$f":"SUM(IF((INDEX(compo,2,)='Données 3-6 mois glissants'!A71)*(INDEX(compo,,1)=$A$52),INDEX(compo,,),0))","v":0},"Tuiles, briques et produits de construction en terre cuite",0,{"$f":"HLOOKUP(C71,'Composition index'!$A$2:$AR$3,2,FALSE)","v":"010534638"},{"$f":"SUM(IF((INDEX(base_indices,1,)=E71)*(INDEX(base_indices,,1)>=$B$1)*(INDEX(base_indices,,1)<=$C$1),INDEX(base_indices,,),0))/SUM(IF((INDEX(base_indices,1,)=E71)*(INDEX(base_indices,,1)>=$D$1)*(INDEX(base_indices,,1)<=$E$1),INDEX(base_indices,,),0))-1","v":7.6433121019108263E-3},{"$f":"SUM(IF((INDEX(base_indices,1,)=E71)*(INDEX(base_indices,,1)>=$B$3)*(INDEX(base_indices,,1)<=$C$3),INDEX(base_indices,,),0))/SUM(IF((INDEX(base_indices,1,)=E71)*(INDEX(base_indices,,1)>=$D$3)*(INDEX(base_indices,,1)<=$E$3),INDEX(base_indices,,),0))-1","v":2.2049286640726473E-2},null,17]
[{"$f":"OFFSET('Composition index'!$J$2,0,I72)","v":"Tuyaux d'assainissement"},{"$f":"SUM(IF((INDEX(compo,2,)='Données 3-6 mois glissants'!A72)*(INDEX(compo,,1)=$A$52),INDEX(compo,,),0))","v":0},"Tuyaux d'assainissement",0,{"$f":"HLOOKUP(C72,'Composition index'!$A$2:$AR$3,2,FALSE)","v":"010534253"},{"$f":"SUM(IF((INDEX(base_indices,1,)=E72)*(INDEX(base_indices,,1)>=$B$1)*(INDEX(base_indices,,1)<=$C$1),INDEX(base_indices,,),0))/SUM(IF((INDEX(base_indices,1,)=E72)*(INDEX(base_indices,,1)>=$D$1)*(INDEX(base_indices,,1)<=$E$1),INDEX(base_indices,,),0))-1","v":1.4519056261342866E-2},{"$f":"SUM(IF((INDEX(base_indices,1,)=E72)*(INDEX(base_indices,,1)>=$B$3)*(INDEX(base_indices,,1)<=$C$3),INDEX(base_indices,,),0))/SUM(IF((INDEX(base_indices,1,)=E72)*(INDEX(base_indices,,1)>=$D$3)*(INDEX(base_indices,,1)<=$E$3),INDEX(base_indices,,),0))-1","v":6.2031573911656812E-2},null,18]
[{"$f":"OFFSET('Composition index'!$J$2,0,I73)","v":"Autres textiles n.c.a."},{"$f":"SUM(IF((INDEX(compo,2,)='Données 3-6 mois glissants'!A73)*(INDEX(compo,,1)=$A$52),INDEX(compo,,),0))","v":0},"Autres textiles n.c.a.",0,{"$f":"HLOOKUP(C73,'Composition index'!$A$2:$AR$3,2,FALSE)","v":"010534559"},{"$f":"SUM(IF((INDEX(base_indices,1,)=E73)*(INDEX(base_indices,,1)>=$B$1)*(INDEX(base_indices,,1)<=$C$1),INDEX(base_indices,,),0))/SUM(IF((INDEX(base_indices,1,)=E73)*(INDEX(base_indices,,1)>=$D$1)*(INDEX(base_indices,,1)<=$E$1),INDEX(base_indices,,),0))-1","v":6.7922198209322548E-3},{"$f":"SUM(IF((INDEX(base_indices,1,)=E73)*(INDEX(base_indices,,1)>=$B$3)*(INDEX(base_indices,,1)<=$C$3),INDEX(base_indices,,),0))/SUM(IF((INDEX(base_indices,1,)=E73)*(INDEX(base_indices,,1)>=$D$3)*(INDEX(base_indices,,1)<=$E$3),INDEX(base_indices,,),0))-1","v":3.0864197530864335E-3},null,19]
[{"$f":"OFFSET('Composition index'!$J$2,0,I74)","v":"Matières plastiques sous formes primaires"},{"$f":"SUM(IF((INDEX(compo,2,)='Données 3-6 mois glissants'!A74)*(INDEX(compo,,1)=$A$52),INDEX(compo,,),0))","v":0},"Matières plastiques sous formes primaires",0,{"$f":"HLOOKUP(C74,'Composition index'!$A$2:$AR$3,2,FALSE)","v":"010534606"},{"$f":"SUM(IF((INDEX(base_indices,1,)=E74)*(INDEX(base_indices,,1)>=$B$1)*(INDEX(base_indices,,1)<=$C$1),INDEX(base_indices,,),0))/SUM(IF((INDEX(base_indices,1,)=E74)*(INDEX(base_indices,,1)>=$D$1)*(INDEX(base_indices,,1)<=$E$1),INDEX(base_indices,,),0))-1","v":-1.6895969104513409E-3},{"$f":"SUM(IF((INDEX(base_indices,1,)=E74)*(INDEX(base_indices,,1)>=$B$3)*(INDEX(base_indices,,1)<=$C$3),INDEX(base_indices,,),0))/SUM(IF((INDEX(base_indices,1,)=E74)*(INDEX(base_indices,,1)>=$D$3)*(INDEX(base_indices,,1)<=$E$3),INDEX(base_indices,,),0))-1","v":0.26532171786642222},null,20]
[{"$f":"OFFSET('Composition index'!$J$2,0,I75)","v":"Tubes, tuyaux, profilés creux et accessoires correspondants en acier"},{"$f":"SUM(IF((INDEX(compo,2,)='Données 3-6 mois glissants'!A75)*(INDEX(compo,,1)=$A$52),INDEX(compo,,),0))","v":0},"Tubes, tuyaux, profilés creux et accessoires correspondants en acier",0,{"$f":"HLOOKUP(C75,'Composition index'!$A$2:$AR$3,2,FALSE)","v":"010534654"},{"$f":"SUM(IF((INDEX(base_indices,1,)=E75)*(INDEX(base_indices,,1)>=$B$1)*(INDEX(base_indices,,1)<=$C$1),INDEX(base_indices,,),0))/SUM(IF((INDEX(base_indices,1,)=E75)*(INDEX(base_indices,,1)>=$D$1)*(INDEX(base_indices,,1)<=$E$1),INDEX(base_indices,,),0))-1","v":2.8288130650335308E-2},{"$f":"SUM(IF((INDEX(base_indices,1,)=E75)*(INDEX(base_indices,,1)>=$B$3)*(INDEX(base_indices,,1)<=$C$3),INDEX(base_indices,,),0))/SUM(IF((INDEX(base_indices,1,)=E75)*(INDEX(base_indices,,1)>=$D$3)*(INDEX(base_indices,,1)<=$E$3),INDEX(base_indices,,),0))-1","v":5.8277541083384232E-2},null,21]
[{"$f":"OFFSET('Composition index'!$J$2,0,I76)","v":"Éléments en béton pour la construction"},{"$f":"SUM(IF((INDEX(compo,2,)='Données 3-6 mois glissants'!A76)*(INDEX(compo,,1)=$A$52),INDEX(compo,,),0))","v":0},"Éléments en béton pour la construction",0,{"$f":"HLOOKUP(C76,'Composition index'!$A$2:$AR$3,2,FALSE)","v":"010534645"},{"$f":"SUM(IF((INDEX(base_indices,1,)=E76)*(INDEX(base_indices,,1)>=$B$1)*(INDEX(base_indices,,1)<=$C$1),INDEX(base_indices,,),0))/SUM(IF((INDEX(base_indices,1,)=E76)*(INDEX(base_indices,,1)>=$D$1)*(INDEX(base_indices,,1)<=$E$1),INDEX(base_indices,,),0))-1","v":7.6238881829733263E-3},{"$f":"SUM(IF((INDEX(base_indices,1,)=E76)*(INDEX(base_indices,,1)>=$B$3)*(INDEX(base_indices,,1)<=$C$3),INDEX(base_indices,,),0))/SUM(IF((INDEX(base_indices,1,)=E76)*(INDEX(base_indices,,1)>=$D$3)*(INDEX(base_indices,,1)<=$E$3),INDEX(base_indices,,),0))-1","v":1.5097976228718224E-2},null,22]
[{"$f":"OFFSET('Composition index'!$J$2,0,I77)","v":"Fils et câbles d'énergie"},{"$f":"SUM(IF((INDEX(compo,2,)='Données 3-6 mois glissants'!A77)*(INDEX(compo,,1)=$A$52),INDEX(compo,,),0))","v":0},"Fils et câbles d'énergie",0,{"$f":"HLOOKUP(C77,'Composition index'!$A$2:$AR$3,2,FALSE)","v":"010534330"},{"$f":"SUM(IF((INDEX(base_indices,1,)=E77)*(INDEX(base_indices,,1)>=$B$1)*(INDEX(base_indices,,1)<=$C$1),INDEX(base_indices,,),0))/SUM(IF((INDEX(base_indices,1,)=E77)*(INDEX(base_indices,,1)>=$D$1)*(INDEX(base_indices,,1)<=$E$1),INDEX(base_indices,,),0))-1","v":6.4367816091953856E-2},{"$f":"SUM(IF((INDEX(base_indices,1,)=E77)*(INDEX(base_indices,,1)>=$B$3)*(INDEX(base_indices,,1)<=$C$3),INDEX(base_indices,,),0))/SUM(IF((INDEX(base_indices,1,)=E77)*(INDEX(base_indices,,1)>=$D$3)*(INDEX(base_indices,,1)<=$E$3),INDEX(base_indices,,),0))-1","v":0.18411076314488195},null,23]
[{"$f":"OFFSET('Composition index'!$J$2,0,I78)","v":"Moteurs, génératrices, transfo. électr., matér. distrib., cmde électr."},{"$f":"SUM(IF((INDEX(compo,2,)='Données 3-6 mois glissants'!A78)*(INDEX(compo,,1)=$A$52),INDEX(compo,,),0))","v":0},"Moteurs, génératrices, transfo. électr., matér. distrib., cmde électr.",0,{"$f":"HLOOKUP(C78,'Composition index'!$A$2:$AR$3,2,FALSE)","v":"010534696"},{"$f":"SUM(IF((INDEX(base_indices,1,)=E78)*(INDEX(base_indices,,1)>=$B$1)*(INDEX(base_indices,,1)<=$C$1),INDEX(base_indices,,),0))/SUM(IF((INDEX(base_indices,1,)=E78)*(INDEX(base_indices,,1)>=$D$1)*(INDEX(base_indices,,1)<=$E$1),INDEX(base_indices,,),0))-1","v":1.4294790343075015E-2},{"$f":"SUM(IF((INDEX(base_indices,1,)=E78)*(INDEX(base_indices,,1)>=$B$3)*(INDEX(base_indices,,1)<=$C$3),INDEX(base_indices,,),0))/SUM(IF((INDEX(base_indices,1,)=E78)*(INDEX(base_indices,,1)>=$D$3)*(INDEX(base_indices,,1)<=$E$3),INDEX(base_indices,,),0))-1","v":1.2615777706803E-2},null,24]
[{"$f":"OFFSET('Composition index'!$J$2,0,I79)","v":"Matériel de distribution et de commande électrique"},{"$f":"SUM(IF((INDEX(compo,2,)='Données 3-6 mois glissants'!A79)*(INDEX(compo,,1)=$A$52),INDEX(compo,,),0))","v":0},"Matériel de distribution et de commande électrique",0,{"$f":"HLOOKUP(C79,'Composition index'!$A$2:$AR$3,2,FALSE)","v":"010534698"},{"$f":"SUM(IF((INDEX(base_indices,1,)=E79)*(INDEX(base_indices,,1)>=$B$1)*(INDEX(base_indices,,1)<=$C$1),INDEX(base_indices,,),0))/SUM(IF((INDEX(base_indices,1,)=E79)*(INDEX(base_indices,,1)>=$D$1)*(INDEX(base_indices,,1)<=$E$1),INDEX(base_indices,,),0))-1","v":1.2614317250078777E-2},{"$f":"SUM(IF((INDEX(base_indices,1,)=E79)*(INDEX(base_indices,,1)>=$B$3)*(INDEX(base_indices,,1)<=$C$3),INDEX(base_indices,,),0))/SUM(IF((INDEX(base_indices,1,)=E79)*(INDEX(base_indices,,1)>=$D$3)*(INDEX(base_indices,,1)<=$E$3),INDEX(base_indices,,),0))-1","v":1.4303877940241572E-2},null,25]
[{"$f":"OFFSET('Composition index'!$J$2,0,I80)","v":"Appareils d'éclairage électrique"},{"$f":"SUM(IF((INDEX(compo,2,)='Données 3-6 mois glissants'!A80)*(INDEX(compo,,1)=$A$52),INDEX(compo,,),0))","v":0},"Appareils d'éclairage électrique",0,{"$f":"HLOOKUP(C80,'Composition index'!$A$2:$AR$3,2,FALSE)","v":"010534702"},{"$f":"SUM(IF((INDEX(base_indices,1,)=E80)*(INDEX(base_indices,,1)>=$B$1)*(INDEX(base_indices,,1)<=$C$1),INDEX(base_indices,,),0))/SUM(IF((INDEX(base_indices,1,)=E80)*(INDEX(base_indices,,1)>=$D$1)*(INDEX(base_indices,,1)<=$E$1),INDEX(base_indices,,),0))-1","v":-9.6054888507719483E-3},{"$f":"SUM(IF((INDEX(base_indices,1,)=E80)*(INDEX(base_indices,,1)>=$B$3)*(INDEX(base_indices,,1)<=$C$3),INDEX(base_indices,,),0))/SUM(IF((INDEX(base_indices,1,)=E80)*(INDEX(base_indices,,1)>=$D$3)*(INDEX(base_indices,,1)<=$E$3),INDEX(base_indices,,),0))-1","v":-1.2425531914893595E-2},null,26]
[{"$f":"OFFSET('Composition index'!$J$2,0,I81)","v":"Câbles de fibres optiques"},{"$f":"SUM(IF((INDEX(compo,2,)='Données 3-6 mois glissants'!A81)*(INDEX(compo,,1)=$A$52),INDEX(compo,,),0))","v":0},"Câbles de fibres optiques",0,{"$f":"HLOOKUP(C81,'Composition index'!$A$2:$AR$3,2,FALSE)","v":"010535345"},{"$f":"SUM(IF((INDEX(base_indices,1,)=E81)*(INDEX(base_indices,,1)>=$B$1)*(INDEX(base_indices,,1)<=$C$1),INDEX(base_indices,,),0))/SUM(IF((INDEX(base_indices,1,)=E81)*(INDEX(base_indices,,1)>=$D$1)*(INDEX(base_indices,,1)<=$E$1),INDEX(base_indices,,),0))-1","v":-9.752925877763996E-4},{"$f":"SUM(IF((INDEX(base_indices,1,)=E81)*(INDEX(base_indices,,1)>=$B$3)*(INDEX(base_indices,,1)<=$C$3),INDEX(base_indices,,),0))/SUM(IF((INDEX(base_indices,1,)=E81)*(INDEX(base_indices,,1)>=$D$3)*(INDEX(base_indices,,1)<=$E$3),INDEX(base_indices,,),0))-1","v":-2.7979766044893939E-2},null,27]
[{"$f":"OFFSET('Composition index'!$J$2,0,I82)","v":"Peintures Industries"},{"$f":"SUM(IF((INDEX(compo,2,)='Données 3-6 mois glissants'!A82)*(INDEX(compo,,1)=$A$52),INDEX(compo,,),0))","v":0},"Peintures Industries",0,{"$f":"HLOOKUP(C82,'Composition index'!$A$2:$AR$3,2,FALSE)","v":"010534180"},{"$f":"SUM(IF((INDEX(base_indices,1,)=E82)*(INDEX(base_indices,,1)>=$B$1)*(INDEX(base_indices,,1)<=$C$1),INDEX(base_indices,,),0))/SUM(IF((INDEX(base_indices,1,)=E82)*(INDEX(base_indices,,1)>=$D$1)*(INDEX(base_indices,,1)<=$E$1),INDEX(base_indices,,),0))-1","v":6.4068497195157947E-2},{"$f":"SUM(IF((INDEX(base_indices,1,)=E82)*(INDEX(base_indices,,1)>=$B$3)*(INDEX(base_indices,,1)<=$C$3),INDEX(base_indices,,),0))/SUM(IF((INDEX(base_indices,1,)=E82)*(INDEX(base_indices,,1)>=$D$3)*(INDEX(base_indices,,1)<=$E$3),INDEX(base_indices,,),0))-1","v":5.9402939839369617E-2},null,28]
[{"$f":"OFFSET('Composition index'!$J$2,0,I83)","v":"Produits sidérurgiques en acier non allié"},{"$f":"SUM(IF((INDEX(compo,2,)='Données 3-6 mois glissants'!A83)*(INDEX(compo,,1)=$A$52),INDEX(compo,,),0))","v":0},"Produits sidérurgiques en acier non allié",0,{"$f":"HLOOKUP(C83,'Composition index'!$A$2:$AR$3,2,FALSE)","v":"010534267"},{"$f":"SUM(IF((INDEX(base_indices,1,)=E83)*(INDEX(base_indices,,1)>=$B$1)*(INDEX(base_indices,,1)<=$C$1),INDEX(base_indices,,),0))/SUM(IF((INDEX(base_indices,1,)=E83)*(INDEX(base_indices,,1)>=$D$1)*(INDEX(base_indices,,1)<=$E$1),INDEX(base_indices,,),0))-1","v":9.6252755326965422E-2},{"$f":"SUM(IF((INDEX(base_indices,1,)=E83)*(INDEX(base_indices,,1)>=$B$3)*(INDEX(base_indices,,1)<=$C$3),INDEX(base_indices,,),0))/SUM(IF((INDEX(base_indices,1,)=E83)*(INDEX(base_indices,,1)>=$D$3)*(INDEX(base_indices,,1)<=$E$3),INDEX(base_indices,,),0))-1","v":0.22149279292136415},null,29]
[{"$f":"OFFSET('Composition index'!$J$2,0,I84)","v":"Tôles quarto en aciers non alliés"},{"$f":"SUM(IF((INDEX(compo,2,)='Données 3-6 mois glissants'!A84)*(INDEX(compo,,1)=$A$52),INDEX(compo,,),0))","v":0},"Tôles quarto en aciers non alliés",0,{"$f":"HLOOKUP(C84,'Composition index'!$A$2:$AR$3,2,FALSE)","v":"010536480"},{"$f":"SUM(IF((INDEX(base_indices,1,)=E84)*(INDEX(base_indices,,1)>=$B$1)*(INDEX(base_indices,,1)<=$C$1),INDEX(base_indices,,),0))/SUM(IF((INDEX(base_indices,1,)=E84)*(INDEX(base_indices,,1)>=$D$1)*(INDEX(base_indices,,1)<=$E$1),INDEX(base_indices,,),0))-1","v":0.19175349146530674},{"$f":"SUM(IF((INDEX(base_indices,1,)=E84)*(INDEX(base_indices,,1)>=$B$3)*(INDEX(base_indices,,1)<=$C$3),INDEX(base_indices,,),0))/SUM(IF((INDEX(base_indices,1,)=E84)*(INDEX(base_indices,,1)>=$D$3)*(INDEX(base_indices,,1)<=$E$3),INDEX(base_indices,,),0))-1","v":0.4941816533172132},null,30]
[{"$f":"OFFSET('Composition index'!$J$2,0,I85)","v":"Éléments en métal pour la construction"},{"$f":"SUM(IF((INDEX(compo,2,)='Données 3-6 mois glissants'!A85)*(INDEX(compo,,1)=$A$52),INDEX(compo,,),0))","v":0},"Éléments en métal pour la construction",0,{"$f":"HLOOKUP(C85,'Composition index'!$A$2:$AR$3,2,FALSE)","v":"010534667"},{"$f":"SUM(IF((INDEX(base_indices,1,)=E85)*(INDEX(base_indices,,1)>=$B$1)*(INDEX(base_indices,,1)<=$C$1),INDEX(base_indices,,),0))/SUM(IF((INDEX(base_indices,1,)=E85)*(INDEX(base_indices,,1)>=$D$1)*(INDEX(base_indices,,1)<=$E$1),INDEX(base_indices,,),0))-1","v":4.878752886836013E-2},{"$f":"SUM(IF((INDEX(base_indices,1,)=E85)*(INDEX(base_indices,,1)>=$B$3)*(INDEX(base_indices,,1)<=$C$3),INDEX(base_indices,,),0))/SUM(IF((INDEX(base_indices,1,)=E85)*(INDEX(base_indices,,1)>=$D$3)*(INDEX(base_indices,,1)<=$E$3),INDEX(base_indices,,),0))-1","v":6.7860367138128153E-2},null,31]
[{"$f":"OFFSET('Composition index'!$J$2,0,I86)","v":"Restaurants et hôtels"},{"$f":"SUM(IF((INDEX(compo,2,)='Données 3-6 mois glissants'!A86)*(INDEX(compo,,1)=$A$52),INDEX(compo,,),0))","v":0},"Restaurants et hôtels",0,{"$f":"HLOOKUP(C86,'Composition index'!$A$2:$AR$3,2,FALSE)","v":"001763781"},{"$f":"SUM(IF((INDEX(base_indices,1,)=E86)*(INDEX(base_indices,,1)>=$B$1)*(INDEX(base_indices,,1)<=$C$1),INDEX(base_indices,,),0))/SUM(IF((INDEX(base_indices,1,)=E86)*(INDEX(base_indices,,1)>=$D$1)*(INDEX(base_indices,,1)<=$E$1),INDEX(base_indices,,),0))-1","v":2.0182530932255416E-2},{"$f":"SUM(IF((INDEX(base_indices,1,)=E86)*(INDEX(base_indices,,1)>=$B$3)*(INDEX(base_indices,,1)<=$C$3),INDEX(base_indices,,),0))/SUM(IF((INDEX(base_indices,1,)=E86)*(INDEX(base_indices,,1)>=$D$3)*(INDEX(base_indices,,1)<=$E$3),INDEX(base_indices,,),0))-1","v":2.5799328191092208E-2},null,32]
[{"$f":"OFFSET('Composition index'!$J$2,0,I87)","v":"Traitement et élimination des déchets non dangereux"},{"$f":"SUM(IF((INDEX(compo,2,)='Données 3-6 mois glissants'!A87)*(INDEX(compo,,1)=$A$52),INDEX(compo,,),0))","v":0},"Traitement et élimination des déchets non dangereux",0,{"$f":"HLOOKUP(C87,'Composition index'!$A$2:$AR$3,2,FALSE)","v":"010534789"},{"$f":"SUM(IF((INDEX(base_indices,1,)=E87)*(INDEX(base_indices,,1)>=$B$1)*(INDEX(base_indices,,1)<=$C$1),INDEX(base_indices,,),0))/SUM(IF((INDEX(base_indices,1,)=E87)*(INDEX(base_indices,,1)>=$D$1)*(INDEX(base_indices,,1)<=$E$1),INDEX(base_indices,,),0))-1","v":1.9768426998023614E-3},{"$f":"SUM(IF((INDEX(base_indices,1,)=E87)*(INDEX(base_indices,,1)>=$B$3)*(INDEX(base_indices,,1)<=$C$3),INDEX(base_indices,,),0))/SUM(IF((INDEX(base_indices,1,)=E87)*(INDEX(base_indices,,1)>=$D$3)*(INDEX(base_indices,,1)<=$E$3),INDEX(base_indices,,),0))-1","v":2.5756041093908388E-2},null,33]
[{"$f":"OFFSET('Composition index'!$J$2,0,I88)","v":"Collecte, traitement et élimination des déchets ; récupération de matériaux"},{"$f":"SUM(IF((INDEX(compo,2,)='Données 3-6 mois glissants'!A88)*(INDEX(compo,,1)=$A$52),INDEX(compo,,),0))","v":0},"Collecte, traitement et élimination des déchets ; récupération de matériaux",0,{"$f":"HLOOKUP(C88,'Composition index'!$A$2:$AR$3,2,FALSE)","v":"010534784"},{"$f":"SUM(IF((INDEX(base_indices,1,)=E88)*(INDEX(base_indices,,1)>=$B$1)*(INDEX(base_indices,,1)<=$C$1),INDEX(base_indices,,),0))/SUM(IF((INDEX(base_indices,1,)=E88)*(INDEX(base_indices,,1)>=$D$1)*(INDEX(base_indices,,1)<=$E$1),INDEX(base_indices,,),0))-1","v":-5.7581573896352545E-3},{"$f":"SUM(IF((INDEX(base_indices,1,)=E88)*(INDEX(base_indices,,1)>=$B$3)*(INDEX(base_indices,,1)<=$C$3),INDEX(base_indices,,),0))/SUM(IF((INDEX(base_indices,1,)=E88)*(INDEX(base_indices,,1)>=$D$3)*(INDEX(base_indices,,1)<=$E$3),INDEX(base_indices,,),0))-1","v":9.9803417510963E-2},null,34]

{"sheet":"Index","index":3,"n_rows":94,"n_cols":24,"rows_kept":94,"cut":false,"hidden":true,"merged":[]}
["Les index Bâtiment, Travaux publics et divers de la construction en juillet 2021 - Informations rapides - 264 | Insee"]
[]
[]
[null,"Index général tous travaux","Travaux de génie civil et d’ouvrages d’art neufs ou rénovation","Grands terrassements","Travaux à l’explosif","Fondations et travaux géotechniques ","Travaux en souterrains traditionnels ","Travaux en souterrains avec tunnelier ","Grands dragages maritimes ","Dragages fluviaux et petits dragages maritimes","Travaux de génie civil, béton et acier pour ouvrages maritimes","Travaux d’aménagement et entretien de voirie","Fabrication et mise en œuvre d’enrobés ","Canalisations, assainissement et adduction d’eau avec fourniture de tuyaux ","Canalisations sans fourniture de tuyaux","Réhabilitation de canalisations non visitables","Réseaux de chauffage et de froid avec fourniture de tuyaux","Canalisations grandes distances de transport / transfert  avec fourniture de tuyaux","Réseaux d'énergie et de communication","Éclairage public -Travaux d'installation","Éclairage public - Travaux  de maintenance","Réseaux de communication en fibre optique","Charpentes et ouvrages d’art métalliques ","Travaux immergés par scaphandriers"]
[null,"All works General index ","New civil engineering and structure works, or renovation","Large-scale excavation works","Blasting works","Foundations and geotechnical works","Traditional underground works","Underground works in tunnel boring machines","Large-scale marine dredging","River dredging and small marine dredging","Civil works, concrete and steel for maritime works","Roads development works and maintenance","Making and implementation of mixes","Pipe works, sanitation and water supply, with supply of pipes","Pipe works, with no supply of pipes","Rehabilitation of non-visitable pipes","Heating and cooling networks with supply of pipes","Long-distance transport / transfer pipelines, pipes supplied","Energy and communication networking","Public lighting Installation works","Public lighting Maintenance works","Fiber optic networks","Carpentry and metal art works","Underwater works by divers"]
[null,"Base 2010","Base 2010","Base 2010","Base 2010","Base 2010","Base 2010","Base 2010","Base 2010","Base 2010","Base 2010","Base 2010","Base 2010","Base 2010","Base 2010","Base 2010","Base 2010","Base 2010","Base 2010","Base 2010","Base 2010","Base 2010","Base 2010","Base 2010"]
[null,"TP01","TP02","TP03a","TP03b","TP04","TP05a","TP05b","TP06a","TP06b","TP07b","TP08","TP09","TP10a","TP10b","TP10c","TP10d","TP11","TP12a","TP12b","TP12c","TP12d","TP13","TP14"]
["2014-10-01",106.5,106.4,105.8,103.3,105.4,105,105,104.6,104.7,99.9,107.1,108.6,106.5,107,106.9,{"$error":"#N/A"},105.4,106.3,106.5,107.2,"nd",103.9,106.9]
["2014-11-01",105.6,106,105.4,103,104.8,104.5,104.5,102.1,104.1,99.2,105.5,104.7,106.4,106.8,106,{"$error":"#N/A"},105.2,106.2,105.9,106.8,"nd",103.9,106.6]
["2014-12-01",104.1,105.7,104.2,101.3,103.8,103.8,103.9,97.6,102.2,98.3,103.2,99.3,105.7,106.4,104.5,{"$error":"#N/A"},103.7,105.9,105.7,106.6,"nd",103.1,106]
["2015-01-01",102.8,105.8,104.2,102.3,103.7,104.1,104.2,98.7,102.2,97.5,100.6,92.5,105.6,106.6,102.9,{"$error":"#N/A"},103.1,105.7,105.4,106.6,"nd",102.9,105.8]
["2015-02-01",103,105.7,104.9,103,104.1,104.3,104.5,102.2,103.4,97.8,100.8,92.2,105.6,106.8,101.9,{"$error":"#N/A"},102.6,105.9,104.7,106.7,"nd",103.1,106.4]
["2015-03-01",103.5,105.8,104.9,103.7,104.2,104.4,104.6,101.8,103.6,98.4,101.6,94.3,105.7,106.9,102.8,{"$error":"#N/A"},102.6,105.9,105.4,107,"nd",103.2,106.7]
["2015-04-01",103.6,105.9,105,103.7,104.2,104.6,104.7,104.3,103.8,98.5,101.5,94.6,105.8,106.8,103.6,{"$error":"#N/A"},102.8,105.9,105.4,107.1,"nd",103.2,106.7]
["2015-05-01",104.1,106.1,105.6,103.9,104.8,104.7,104.9,104,104.5,98.4,102.3,96,105.9,107.2,107.4,{"$error":"#N/A"},102.3,106.2,104.8,107,"nd",103.1,106.9]
["2015-06-01",104.1,106,105.3,103.7,104.5,104.5,104.7,103.5,104,97.7,102.7,97.4,105.6,106.9,108,{"$error":"#N/A"},101.8,106.2,104.8,106.9,"nd",102.8,106.9]
["2015-07-01",103.6,106.2,104.9,103.2,104.2,104.4,104.7,101.4,103.4,97.6,102.1,95.7,106,106.9,108.4,{"$error":"#N/A"},101.8,106.2,104.3,106.8,"nd",102.8,106.9]
["2015-08-01",102.9,106.2,104.4,102.7,103.7,104.4,104.6,98.7,102.3,97.7,101,93,105.9,106.9,107,{"$error":"#N/A"},101.4,105.9,104.1,106.8,"nd",102.3,106.6]
["2015-09-01",101.9,105.6,104.2,102.7,103.2,103.5,103.8,98.2,102.2,96.7,99.4,89.2,105.4,106.5,105.2,{"$error":"#N/A"},100.6,105.5,103.8,106.6,"nd",101.7,106]
["2015-10-01",101.7,105.2,104,102.6,102.7,103.3,103.6,98.5,102,96.1,99,88.4,105.5,106.5,103.8,{"$error":"#N/A"},100.7,105.5,103.6,106.7,"nd",101.6,105.9]
["2015-11-01",101.6,105.2,104.2,102.7,102.7,103.2,103.7,98.6,102.4,94.7,98.8,87.8,105.8,106.7,104.2,{"$error":"#N/A"},101.1,105.3,103,106.6,"nd",101.6,106]
["2015-12-01",100.8,104.5,103.2,101.6,101.4,102.5,103,95.2,100.6,92.9,97.9,86.2,105.2,106.5,104.1,{"$error":"#N/A"},99.9,105.1,103.2,106.5,"nd",100.8,105.7]
["2016-01-01",100.2,104.1,103.3,101.6,100.9,102.1,102.7,96.3,100.6,91.5,96.7,83.2,105.2,106.5,103.9,{"$error":"#N/A"},100.8,105.2,103.7,106.5,"nd",100.6,105.5]
["2016-02-01",100,103.6,103.3,101.7,100.4,101.8,102.4,96.1,100.6,91.1,96.4,82.6,105.1,106.5,103.1,{"$error":"#N/A"},100.7,104.7,103.6,106.6,"nd",100.9,105.6]
["2016-03-01",100.3,103.6,103.6,102.3,100.7,101.7,102.4,96.8,101.5,91.1,96.5,82.8,105.1,106.5,103,{"$error":"#N/A"},99.7,104.9,103,106.8,"nd",101.3,106]
["2016-04-01",100.6,103.9,103.7,102,101.1,101.9,102.6,98,101.5,91.6,96.9,83.7,105.1,106.7,104.4,{"$error":"#N/A"},99.3,105,103.1,107.1,"nd",101.7,106.2]
["2016-05-01",101.2,104.4,104.2,102.6,101.8,102.3,102.8,99,102.4,92.4,97.7,85.4,105.4,107.1,104.6,{"$error":"#N/A"},99.9,105.4,102.8,107.2,"nd",101.8,106.7]
["2016-06-01",102.1,105.6,104.4,102.8,103.2,103.3,103.7,100.7,102.7,95.1,99,88.6,105.3,107.2,105.2,{"$error":"#N/A"},98.7,105.6,103.3,107.8,"nd",102.3,107.2]
["2016-07-01",102.3,105.9,104.4,102.6,103.4,103.8,104.1,99.7,102.4,95.6,99.5,89.8,105.2,107.4,105.1,{"$error":"#N/A"},98.4,105.7,102.1,107.4,"nd",102.7,107.5]
["2016-08-01",102.3,106.4,104.3,102.6,103.8,104.2,104.5,101,102.5,96.4,99.3,89.5,105.2,107.2,105,{"$error":"#N/A"},98.6,105.6,102.2,107.4,"nd",102.7,107.6]
["2016-09-01",102.6,106.5,104.5,102.7,104,104.2,104.5,101,102.6,96.9,99.6,90.2,105.3,107.4,105.5,{"$error":"#N/A"},99.2,105.8,103.5,107.7,"nd",102.9,107.4]
["2016-10-01",103,106,104.9,103.3,103.6,103.7,104.2,102.1,103.3,96.2,100.3,91.6,105.5,107.7,105.9,{"$error":"#N/A"},99.6,105.9,104.4,108.2,"nd",103,107.7]
["2016-11-01",103.3,106.2,104.9,103.2,103.5,103.9,104.5,102.1,103.2,96.2,100.8,93.1,105.8,107.9,105.8,{"$error":"#N/A"},100,105.9,104.1,108.2,"nd",103.4,107.8]
["2016-12-01",103.7,106.5,105.2,103.8,104.1,104.3,104.7,104.9,103.9,97.3,101.5,94.3,105.8,107.9,105.5,{"$error":"#N/A"},100.1,106.3,104.3,108.2,"nd",104,108.3]
["2017-01-01",104.9,107,105.8,104,104.8,104.7,105.2,105.9,104.4,98.5,103.2,98.6,106.1,108.5,107,{"$error":"#N/A"},100.2,107,104.8,108.7,"nd",104.1,108.8]
["2017-02-01",105,107.2,106,104.5,105.1,105.1,105.5,106.1,104.6,99.9,103.2,98.4,106.1,108.6,108,{"$error":"#N/A"},100.5,107.2,105.2,108.9,109.2,104.3,109]
["2017-03-01",105.1,107.6,106,104.7,105.2,105.3,105.8,105.6,104.6,101.6,102.9,97.7,106.4,108.7,108.8,{"$error":"#N/A"},100.7,107.4,105.5,109,109.4,104.6,109.2]
["2017-04-01",104.8,107.7,105.9,104.8,105.5,105.5,105.8,105.4,104.6,102.5,102.4,96.2,106.4,108.7,108.6,{"$error":"#N/A"},101,107.5,105.1,109,109.6,104.6,109.1]
["2017-05-01",105,107.9,105.9,104.4,105.5,105.5,105.8,105.5,104.4,102.6,102.6,96.9,106.7,108.7,108.8,{"$error":"#N/A"},101,107.4,105.1,108.9,109.5,104.3,109.1]
["2017-06-01",104.7,107.9,105.5,104.1,105.5,105.8,106,104.7,103.9,102.9,102,95.9,106.3,108.6,108.2,{"$error":"#N/A"},101.2,107.3,105.6,109,109.7,104.4,109]
["2017-07-01",104.7,108.1,105.7,104.4,105.7,105.9,106.1,104.8,104.1,103.2,102.1,95.7,106.4,108.7,107.3,{"$error":"#N/A"},101.7,107.4,105.6,109,109.8,104.6,109.4]
["2017-08-01",105,108.4,106,104.5,106,106.4,106.5,105.1,104.4,102.8,102.4,95.8,106.8,109,107.9,{"$error":"#N/A"},102.1,107.6,105.2,109.1,109.8,104.7,109.9]
["2017-09-01",105.2,108.8,106.2,104.7,106.6,106.5,106.6,105.2,104.8,102.3,102.6,96.4,106.8,109.1,108.5,{"$error":"#N/A"},101.4,107.7,105.1,109.3,110,106.1,109.7]
["2017-10-01",105.7,109.6,106.3,105,107.4,107.2,107.1,105.9,104.9,102.5,103,97.4,107,109.1,108.8,{"$error":"#N/A"},101.9,107.9,105.7,109.5,110.1,106.1,109.8]
["2017-11-01",106.1,110.4,106.6,105,108.3,107.9,107.8,107.2,105.2,101.6,103.5,98.4,107.2,109.3,108.5,{"$error":"#N/A"},101.7,108.1,105.5,109.6,110.2,106,110.1]
["2017-12-01",106.4,110.7,106.5,105,108.4,108,107.9,107.2,105.4,103.2,104.1,99.8,107.3,109.3,108.9,{"$error":"#N/A"},101.6,108.2,105.8,109.8,110.3,106.5,110.3]
["2018-01-01",107.3,111.2,107.7,107.2,109.5,108.8,108.6,109.7,106.7,105.3,105.1,100.7,107.9,110.1,109.7,{"$error":"#N/A"},102.5,109,106.5,110.4,110.8,108.4,111.2]
["2018-02-01",107.4,111.5,107.6,106.4,109.5,108.9,108.9,109.6,106.4,104.9,105.2,100.8,108,110.2,110,{"$error":"#N/A"},102.6,109.2,106.7,110.5,110.9,107.7,111.1]
["2018-03-01",107.7,112,108.1,107.1,110,109.4,109.3,109.2,106.8,105.3,105.4,100.1,108.3,110.7,110.1,{"$error":"#N/A"},102.7,109.5,106.8,110.8,111.3,112.1,111.7]
["2018-04-01",108.1,112.2,108.5,106.7,110.5,109.6,109.5,110.4,107.5,105.2,105.9,101,108.6,111,109.7,{"$error":"#N/A"},103.8,109.8,108,111.2,111.6,112.5,111.9]
["2018-05-01",108.8,112.4,109.1,107.7,110.9,109.9,109.6,111.2,108,106.7,107,103.5,109.1,111.5,110.3,{"$error":"#N/A"},104.2,110,107.7,111.2,112.1,112.2,112.3]
["2018-06-01",109.6,112.2,108.9,107.8,110.6,109.8,109.5,113.4,108,106.5,108.5,108.3,109.1,111.6,110.9,{"$error":"#N/A"},104.6,110,108.7,111.8,112.5,112.1,112.6]
["2018-07-01",109.8,112.1,109.1,107.5,110.6,109.9,109.7,114,108.1,106.3,108.8,109,109.2,111.6,111.1,{"$error":"#N/A"},104.9,110.2,108.9,111.8,112.5,113.2,113]
["2018-08-01",110.2,112.6,109.3,107.8,111,110.3,110,113.8,108.3,107.2,109.3,109.8,109.4,111.7,111.4,{"$error":"#N/A"},105.1,110.5,109.1,112,112.8,112.7,113.5]
["2018-09-01",110.4,112.9,109.6,108,111.3,110.4,110.1,114.1,108.6,107.4,109.4,110.1,109.7,111.9,111.3,{"$error":"#N/A"},105.4,110.3,109.3,112.2,113.2,113.9,113.3]
["2018-10-01",110.9,113,109.9,108.1,111.6,110.7,110.4,115.9,109,107.4,110.2,111.7,109.9,112,111.8,{"$error":"#N/A"},104.9,110.6,108.4,112.4,113.5,113.8,113.6]
["2018-11-01",111.1,113.1,109.4,107.8,111.1,110.5,110.2,113.4,108.5,107.2,110.7,113.7,109.8,112,112.3,{"$error":"#N/A"},105,110.6,108.7,112.4,113.7,114,113.5]
["2018-12-01",110,113.2,108.9,107.6,110.9,110.5,110.2,110.7,107.7,107.3,108.9,108.9,109.7,111.7,111.6,{"$error":"#N/A"},104.1,110.4,107.1,112.4,113.4,113.9,113.2]
["2019-01-01",109.7,113.5,109.6,107.6,111.2,110.9,110.7,111.2,108.1,107.2,107.9,105.1,110,112.2,110.9,{"$error":"#N/A"},104.7,110.7,108.4,112.8,113.5,113.1,113.5]
["2019-02-01",110.3,113.6,110,108.1,111.4,111.3,111.2,113.4,108.6,106.3,108.8,106.9,110.1,112.4,111.3,{"$error":"#N/A"},104.8,111,108.3,112.7,113.8,113.3,113.8]
["2019-03-01",111.3,114.1,110.5,108.5,111.9,111.8,111.8,114.4,109.3,106.8,110.3,110.4,110.7,112.8,112.1,{"$error":"#N/A"},104.9,111.4,108.9,113.4,114,113.2,114.3]
["2019-04-01",111.6,114.1,110.7,108.6,112,111.6,111.6,114.9,109.5,106.9,110.8,111.5,110.8,113.1,112.2,{"$error":"#N/A"},105.1,111.8,109.7,114,114.4,112.3,114.6]
["2019-05-01",111.8,114.1,110.7,108.6,112.1,111.6,111.3,114.3,109.5,106,111.1,112.5,110.8,113.3,112.9,{"$error":"#N/A"},105.4,111.8,109.5,114.3,114.6,111,115]
["2019-06-01",111.5,114.3,110.4,108.2,112,111.7,111.3,112.7,108.9,105.1,110.6,111.2,110.8,113.3,112.7,{"$error":"#N/A"},105.5,111.9,109.4,114.4,114.8,110.9,115.1]
["2019-07-01",111.5,114.5,110.6,108.4,112,111.9,111.5,114.2,109.2,104.9,110.4,110,111.2,113.4,112,{"$error":"#N/A"},105.3,112.1,108.8,114.4,114.9,113.5,115.7]
["2019-08-01",111.5,114.7,110.6,108.2,112.1,112.3,111.9,110.9,109.2,105.4,110.4,109.9,111.3,113.5,111.5,{"$error":"#N/A"},105.5,112.1,108.8,114.5,115,109.7,115.9]
["2019-09-01",111.2,114.6,111,108.4,112.2,112.1,111.8,113,110,104.4,109.5,107.3,111.3,113.7,111.8,{"$error":"#N/A"},106,112.2,109.1,114.7,115.1,111.9,115.9]
["2019-10-01",111.2,114.2,111,108.8,111.6,111.7,111.5,110.6,110,102.8,109.9,108.2,111.3,113.6,111.5,105.9,106,112.1,108.9,114.7,115.2,112.8,115.9]
["2019-11-01",110.5,114.2,110.9,108.8,111.4,111.7,111.6,108.9,109.8,101.1,108.6,104.3,111.2,113.6,110.7,106,105.6,112.4,108.9,114.6,115.3,112.8,115.9]
["2019-12-01",110.4,114.3,111,109.3,111.5,111.8,111.7,108.3,109.9,99.3,108.4,103.2,111.4,113.6,110.6,105.6,105.7,112.6,108.7,114.7,115.2,112.5,116.1]
["2020-01-01",111.4,114.7,111.3,108.8,111.9,112.3,112.3,111.4,109.9,101.1,110.1,107.7,111.5,114,110.4,105.7,105.3,112.9,108.4,114.8,115.4,112.4,116.3]
["2020-02-01",111.7,114.8,111.1,108.7,111.6,112.1,112.2,110,109.6,100.6,110.7,109.5,111.6,114.1,110.4,105.7,105.1,113,108.3,114.9,115.5,111.5,116.2]
["2020-03-01",110.8,114.7,110.2,107.8,111,111.8,111.9,105.9,108,100.8,109.3,106.8,111.3,113.6,109.7,105.6,105,112.6,108.3,114.7,115.4,112.9,115.7]
["2020-04-01",108.9,114.4,109.4,107.4,110.1,111.3,111.4,103.3,106.6,99.6,106,98.3,111,113.4,108.2,105.4,104.3,112.1,107.8,114.3,115.1,110.6,115]
["2020-05-01",108.7,114.2,109.5,107.4,110.3,111.4,111.2,103.7,106.6,100.5,105.8,97.8,110.9,113.3,106.1,105.5,104.7,111.9,107.5,113.9,114.9,109.8,114.8]
["2020-06-01",108.8,113.7,108.8,107.3,110,111.1,110.7,105.5,106.2,99.6,106.3,100.9,110.3,112.4,106.2,104.6,104.5,111.5,107.6,114,114.8,108.8,114.6]
["2020-07-01",109.9,113.7,108.9,107.3,110,111.2,110.7,106,106.3,99.5,108.4,106.6,110.3,112.6,107.3,104.7,104,111.8,108,114.4,115.1,108.5,115.1]
["2020-08-01",110,113.8,109.1,107.6,110,111.3,110.8,106.4,106.4,100.5,108.3,106.3,110.4,112.7,107.6,104.5,103.7,112.2,107.9,114.5,115.4,110.2,115.5]
["2020-09-01",110.1,114.4,109.2,107.4,110.5,111.9,111.5,106.5,106.7,100.1,108.2,105.6,110.8,113.2,107.9,105.1,104.4,112.1,108,114.6,115.5,110.8,115.1]
["2020-10-01",109.5,114.4,109.1,107.3,110.4,111.7,111.3,106.8,106.6,100.3,107.2,103.1,110.5,112.9,107.9,105.3,104.4,111.9,108.4,114.4,115.3,110.5,114.9]
["2020-11-01",109.5,114.5,109.3,107.8,110.8,111.9,111.6,107.7,107,100.7,106.9,102.1,110.4,113,108.7,105.3,104.3,112,108.5,114.5,115.3,110.3,114.9]
["2020-12-01",109.8,114.9,109.5,108.1,111.2,112.1,112,108.5,107.4,101.6,107.4,102.9,110.6,113.2,109.9,105.6,104.6,112.2,108.8,114.6,115.4,111.1,115.1]
["2021-01-01",111.2,116.3,110.7,107.7,113.5,113.6,113.6,109.4,108,106.1,109,105.5,111.4,114.2,111.5,106.4,105.4,112.9,108.9,114.6,115.6,114.7,115.4]
["2021-02-01",112.1,117.2,111.2,108.2,114.6,114.5,114.4,111.6,108.8,110.6,110.2,107.8,111.8,114.4,113.3,107.3,106.4,113.2,110.1,114.8,115.7,117.5,115.7]
["2021-03-01",113.5,118.3,112.4,109.4,115.9,115.4,115.6,114,110.5,114,111.8,110.9,112.9,115.7,118.1,108.2,106.7,114,110.4,115.1,116,120.8,116.4]
["2021-04-01",113.8,118.9,112.3,109.5,116.3,115.8,115.8,113.5,110.2,115.4,112,111.8,113.3,115.6,122.2,108.5,108,114.3,110.3,114.8,116,118.8,116.3]
["2021-05-01",114,119,112.5,109.6,116.7,115.7,115.5,113.3,110.3,118.1,111.9,111.2,113.7,115.6,124.3,108.6,108.3,114.6,111.3,115.1,116,119.3,116.3]
["2021-06-01",114.8,120.8,113.1,110.1,118.5,116.7,116.2,114.4,110.9,123.5,112.6,111.7,114.9,116.1,123.2,109.2,109.1,115.4,112.1,115.3,115.5,118.5,116.7]
["2021-07-01",115.9,122.7,113.3,110.5,120.5,118.3,117.7,115.8,111.3,129.30000000000001,113.9,113.9,115.7,116.2,123.6,109.3,109.7,116.2,112.5,115.3,115.5,121.9,117.1]
["2021-08-01",116.1,123.1,113.4,110.2,120.9,118.5,117.9,115.4,111,131.1,114.1,114.4,116,116.2,122.6,109.4,110,116.4,111.9,114.7,115.3,129.4,117.3]
["2021-09-01",116.4,123.7,113.7,110.4,121.4,118.6,118,116.1,111.5,138,114.2,114.3,116.2,116.3,123.3,110.1,111.4,116.5,113.2,114.9,115.4,135.5,117]
["2021-10-01",117.5,123.6,114.6,111.2,121.5,118.8,118.3,119.7,113.1,137.6,115.8,117.7,116.5,116.1,124.6,110.2,112.5,116.9,114.2,115.3,115.4,139.6,117.6]
["2021-11-01"]
["2021-12-01"]

{"sheet":"Gazole routier HTT","index":4,"n_rows":52,"n_cols":5,"rows_kept":52,"cut":false,"hidden":true,"merged":[]}
[null,"Fioul lourd",null,"Fioul lourd","Gazole routier HTT"]
["2017-10-01",295.7,100,"Prix HTT et TTC depuis janvier 2020 (XLSX - 48.08 Ko)"]
["2017-11-01",322.8,{"$f":"C2*(1+(B3/B2-1))","v":109.16469394656747},"PRIX DE VENTE H.T.V.A."]
["2017-12-01",319.8,{"$f":"C3*(1+(B4/B3-1))","v":108.1501521812648},"Fioul lourd (teneur en soufre <= 1%) en euro par tonne"]
["2018-01-01",324.89999999999998,109.87487318227933,"MOYENNES MENSUELLES"]
["2018-02-01",321,108.55596888738587]
["2018-03-01",306.2,103.55089617855936]
["2018-04-01",325,109.90869124112277]
["2018-05-01",337.8,114.23740277308083]
["2018-06-01",383,129.52316537030777]
["2018-07-01",391.9,132.53297260737236]
["2018-08-01",387.4,131.01115995941836]
["2018-09-01",392.7,132.80351707811977]
["2018-10-01",430.2,145.48528914440317]
["2018-11-01",381,128.84680419343934]
["2018-12-01",325.39999999999998,110.04396347649647]
["2019-01-01",330.7,111.83632059519786]
["2019-02-01",372.1,125.83699695637475]
["2019-03-01",380.8,128.77916807575249]
["2019-04-01",392.7,132.80351707811977]
["2019-05-01",382.1,129.21880284071699]
["2019-06-01",347.9,117.65302671626651]
["2019-07-01",375.3,126.91917483936426]
["2019-08-01",304.8,103.07744335475147]
["2019-09-01",341.8,115.59012512681774]
["2019-10-01",291.7,98.647277646263106]
["2019-11-01",265.8,89.888400405816711]
["2019-12-01",256.10000000000002,86.608048698004751]
["2020-01-01",285.10000000000002,{"$f":"C28*(1+(B29/B28-1))","v":96.41528576259725},631.9,0.61619999999999997]
["2020-02-01",277.60000000000002,93.878931349340561,559.73,0.55640000000000001]
["2020-03-01",199.8,67.568481569157939,414.19,0.46560000000000001]
["2020-04-01",150.69999999999999,50.96381467703754,359.81,0.40360000000000001]
["2020-05-01",163.80000000000001,55.393980385525879,380.71,0.3654]
["2020-06-01",221,74.737910043963481,434.36,0.40060000000000001]
["2020-07-01",null,{"$f":"C34*(1+(D35/D34-1))","v":76.962703249756942},447.29,0.42380000000000001]
["2020-08-01",null,{"$f":"C35*(1+(D36/D35-1))","v":78.186081416283741},454.4,0.41949999999999998]
["2020-09-01",null,{"$f":"C36*(1+(D37/D36-1))","v":75.797826992740568},440.52,0.3947]
["2020-10-01",null,77.969280222215701,453.14,0.39250000000000002]
["2020-11-01",null,80.93739180767102,470.39,0.40450000000000003]
["2020-12-01",null,84.005300768173541,488.22,0.43840000000000001]
["2021-01-01",null,87.475840517659549,508.39,0.4738]
["2021-02-01",null,96.424912028356985,560.4,0.51580000000000004]
["2021-03-01",null,99.707901538530166,579.48,0.54449999999999998]
["2021-04-01",null,97.252541983489749,565.21,0.53620000000000001]
["2021-05-01",null,96.963473724732353,563.53,0.54990000000000006]
["2021-06-01",null,100.23097743532924,582.52,0.57010000000000005]
["2021-07-01",null,{"$f":"C46*(1+(D47/D46-1))","v":104.68228449131354},608.39,0.59050000000000002]
["2021-08-01",null,{"$f":"C47*(1+(E48/E47-1))","v":103.58316482349619},592.49,0.58430000000000004]
["2021-09-01",null,{"$f":"C48*(1+(E49/E48-1))","v":105.88777057859708},622.85,0.59730000000000005]
["2021-10-01",null,{"$f":"C49*(1+(E50/E49-1))","v":119.53812774342542},674.78,0.67430000000000001]
["2021-11-01",null,{"$f":"C50*(1+(E51/E50-1))","v":121.63000065959393},676.2,0.68610000000000004]
["2021-12-01",null,117.58807671987852,650.6,0.6633]

{"sheet":"Fioul lourd","index":5,"n_rows":52,"n_cols":5,"rows_kept":52,"cut":false,"hidden":true,"merged":[]}
[null,"Fioul lourd",null,"Fioul lourd","Indice"]
["2017-10-01",295.7,100,"Prix HTT et TTC depuis janvier 2020 (XLSX - 48.08 Ko)",100]
["2017-11-01",322.8,{"$f":"C2*(1+(B3/B2-1))","v":109.16469394656747},"PRIX DE VENTE H.T.V.A."]
["2017-12-01",319.8,{"$f":"C3*(1+(B4/B3-1))","v":108.1501521812648},"Fioul lourd (teneur en soufre <= 1%) en euro par tonne"]
["2018-01-01",324.89999999999998,109.87487318227933,"MOYENNES MENSUELLES"]
["2018-02-01",321,108.55596888738587]
["2018-03-01",306.2,103.55089617855936]
["2018-04-01",325,109.90869124112277]
["2018-05-01",337.8,114.23740277308083]
["2018-06-01",383,129.52316537030777]
["2018-07-01",391.9,132.53297260737236]
["2018-08-01",387.4,131.01115995941836]
["2018-09-01",392.7,132.80351707811977]
["2018-10-01",430.2,145.48528914440317]
["2018-11-01",381,128.84680419343934]
["2018-12-01",325.39999999999998,110.04396347649647]
["2019-01-01",330.7,111.83632059519786]
["2019-02-01",372.1,125.83699695637475]
["2019-03-01",380.8,128.77916807575249]
["2019-04-01",392.7,132.80351707811977]
["2019-05-01",382.1,129.21880284071699]
["2019-06-01",347.9,117.65302671626651]
["2019-07-01",375.3,126.91917483936426]
["2019-08-01",304.8,103.07744335475147]
["2019-09-01",341.8,115.59012512681774]
["2019-10-01",291.7,98.647277646263106]
["2019-11-01",265.8,89.888400405816711]
["2019-12-01",256.10000000000002,86.608048698004751]
["2020-01-01",285.10000000000002,{"$f":"C28*(1+(B29/B28-1))","v":96.41528576259725},631.9]
["2020-02-01",277.60000000000002,93.878931349340561,559.73]
["2020-03-01",199.8,67.568481569157939,414.19]
["2020-04-01",150.69999999999999,50.96381467703754,359.81]
["2020-05-01",163.80000000000001,55.393980385525879,380.71]
["2020-06-01",221,74.737910043963481,434.36]
["2020-07-01",null,{"$f":"C34*(1+(D35/D34-1))","v":76.962703249756942},447.29]
["2020-08-01",null,{"$f":"C35*(1+(D36/D35-1))","v":78.186081416283741},454.4]
["2020-09-01",null,{"$f":"C36*(1+(D37/D36-1))","v":75.797826992740568},440.52]
["2020-10-01",null,{"$f":"C37*(1+(D38/D37-1))","v":77.969280222215701},453.14]
["2020-11-01",null,80.93739180767102,470.39]
["2020-12-01",null,84.005300768173541,488.22]
["2021-01-01",null,87.475840517659549,508.39]
["2021-02-01",null,96.424912028356985,560.4]
["2021-03-01",null,99.707901538530166,579.48]
["2021-04-01",null,97.252541983489749,565.21]
["2021-05-01",null,96.963473724732353,563.53]
["2021-06-01",null,100.23097743532924,582.52]
["2021-07-01",null,104.68228449131354,608.39]
["2021-08-01",null,101.94645989950256,592.49]
["2021-09-01",null,107.17033628990391,622.85]
["2021-10-01",null,116.10564264542242,674.78]
["2021-11-01",null,116.34997414984831,676.2]
["2021-12-01",null,111.94512449259288,650.6]

{"sheet":"Indice prix","index":6,"n_rows":80,"n_cols":42,"rows_kept":80,"cut":false,"hidden":true,"merged":[]}
[null,"base 2010","base 2008","base 2008","base 2015","base 2015","base 2010","base 2010","base 2015","base 2017","base 2017","base 2015","base 2015","base 2015","base 2015","base 2015","base 2015","base 2015","base 2015","base 2015","base 2015","base 2015","base 2015","base 2015","base 2015","base 2015","base 2015","base 2015","base 2015","base 2015","base 2015","base 2015","base 2015","base 2015","base 2015","base 2015","base 2015","base 2015","base 2015","base 2015","base 2015","base 2015"]
[null,"001711009","5540998","001565195","010534596","001764283","001711011","001711943","010534769","Fioul lourd","Gazole routier HTT","010534207","010534575","010534646","010546545","010536067","010534625","010534642","010534614","010536462","010534598","010534252","010534647","010534662","010534638","010534253","010534559","010534606","010534654","010534645","010534330","010534696","010534698","010534702","010535345","010534180","010534267","010536480","010534667","001763781","010534789","010534784"]
[null,{"$f":"HLOOKUP(B2,'Composition index'!$D$3:$AR$3,1,FALSE)","v":"001711009"},{"$f":"HLOOKUP(C2,'Composition index'!$D$3:$AR$3,1,FALSE)","v":"5540998"},{"$f":"HLOOKUP(D2,'Composition index'!$D$3:$AR$3,1,FALSE)","v":"001565195"},{"$f":"HLOOKUP(E2,'Composition index'!$D$3:$AR$3,1,FALSE)","v":"010534596"},{"$f":"HLOOKUP(F2,'Composition index'!$D$3:$AR$3,1,FALSE)","v":"001764283"},{"$f":"HLOOKUP(G2,'Composition index'!$D$3:$AR$3,1,FALSE)","v":"001711011"},{"$f":"HLOOKUP(H2,'Composition index'!$D$3:$AR$3,1,FALSE)","v":"001711943"},{"$f":"HLOOKUP(I2,'Composition index'!$D$3:$AR$3,1,FALSE)","v":"010534769"},{"$f":"HLOOKUP(J2,'Composition index'!$D$3:$AR$3,1,FALSE)","v":"Fioul lourd"},{"$f":"HLOOKUP(K2,'Composition index'!$D$3:$AR$3,1,FALSE)","v":"Gazole routier HTT"},{"$f":"HLOOKUP(L2,'Composition index'!$D$3:$AR$3,1,FALSE)","v":"010534207"},{"$f":"HLOOKUP(M2,'Composition index'!$D$3:$AR$3,1,FALSE)","v":"010534575"},{"$f":"HLOOKUP(N2,'Composition index'!$D$3:$AR$3,1,FALSE)","v":"010534646"},{"$f":"HLOOKUP(O2,'Composition index'!$D$3:$AR$3,1,FALSE)","v":"010546545"},{"$f":"HLOOKUP(P2,'Composition index'!$D$3:$AR$3,1,FALSE)","v":"010536067"},{"$f":"HLOOKUP(Q2,'Composition index'!$D$3:$AR$3,1,FALSE)","v":"010534625"},{"$f":"HLOOKUP(R2,'Composition index'!$D$3:$AR$3,1,FALSE)","v":"010534642"},{"$f":"HLOOKUP(S2,'Composition index'!$D$3:$AR$3,1,FALSE)","v":"010534614"},{"$f":"HLOOKUP(T2,'Composition index'!$D$3:$AR$3,1,FALSE)","v":"010536462"},{"$f":"HLOOKUP(U2,'Composition index'!$D$3:$AR$3,1,FALSE)","v":"010534598"},{"$f":"HLOOKUP(V2,'Composition index'!$D$3:$AR$3,1,FALSE)","v":"010534252"},{"$f":"HLOOKUP(W2,'Composition index'!$D$3:$AR$3,1,FALSE)","v":"010534647"},{"$f":"HLOOKUP(X2,'Composition index'!$D$3:$AR$3,1,FALSE)","v":"010534662"},{"$f":"HLOOKUP(Y2,'Composition index'!$D$3:$AR$3,1,FALSE)","v":"010534638"},{"$f":"HLOOKUP(Z2,'Composition index'!$D$3:$AR$3,1,FALSE)","v":"010534253"},{"$f":"HLOOKUP(AA2,'Composition index'!$D$3:$AR$3,1,FALSE)","v":"010534559"},{"$f":"HLOOKUP(AB2,'Composition index'!$D$3:$AR$3,1,FALSE)","v":"010534606"},{"$f":"HLOOKUP(AC2,'Composition index'!$D$3:$AR$3,1,FALSE)","v":"010534654"},{"$f":"HLOOKUP(AD2,'Composition index'!$D$3:$AR$3,1,FALSE)","v":"010534645"},{"$f":"HLOOKUP(AE2,'Composition index'!$D$3:$AR$3,1,FALSE)","v":"010534330"},{"$f":"HLOOKUP(AF2,'Composition index'!$D$3:$AR$3,1,FALSE)","v":"010534696"},{"$f":"HLOOKUP(AG2,'Composition index'!$D$3:$AR$3,1,FALSE)","v":"010534698"},{"$f":"HLOOKUP(AH2,'Composition index'!$D$3:$AR$3,1,FALSE)","v":"010534702"},{"$f":"HLOOKUP(AI2,'Composition index'!$D$3:$AR$3,1,FALSE)","v":"010535345"},{"$f":"HLOOKUP(AJ2,'Composition index'!$D$3:$AR$3,1,FALSE)","v":"010534180"},{"$f":"HLOOKUP(AK2,'Composition index'!$D$3:$AR$3,1,FALSE)","v":"010534267"},{"$f":"HLOOKUP(AL2,'Composition index'!$D$3:$AR$3,1,FALSE)","v":"010536480"},{"$f":"HLOOKUP(AM2,'Composition index'!$D$3:$AR$3,1,FALSE)","v":"010534667"},{"$f":"HLOOKUP(AN2,'Composition index'!$D$3:$AR$3,1,FALSE)","v":"001763781"},{"$f":"HLOOKUP(AO2,'Composition index'!$D$3:$AR$3,1,FALSE)","v":"010534789"},{"$f":"HLOOKUP(AP2,'Composition index'!$D$3:$AR$3,1,FALSE)","v":"010534784"}]
[null,"https://www.insee.fr/fr/statistiques/serie/001711009","https://www.insee.fr/fr/statistiques/6020697","https://www.insee.fr/fr/statistiques/serie/001565195","https://www.insee.fr/fr/statistiques/serie/010534596","https://www.insee.fr/fr/statistiques/serie/001764283","https://www.insee.fr/fr/statistiques/serie/001711011","https://www.insee.fr/fr/statistiques/serie/001711943","https://www.insee.fr/fr/statistiques/serie/010534769","https://www.fntp.fr/sites/default/files/content/indice_fioul_lourd.pdf","https://www.fntp.fr/sites/default/files/content/indice_gazole_htt.pdf","https://www.insee.fr/fr/statistiques/serie/010534207","https://www.insee.fr/fr/statistiques/serie/010534575","https://www.insee.fr/fr/statistiques/serie/010534646","https://www.insee.fr/fr/statistiques/serie/010546545","https://www.insee.fr/fr/statistiques/serie/010536067","https://www.insee.fr/fr/statistiques/serie/010534625","https://www.insee.fr/fr/statistiques/serie/010534642","https://www.insee.fr/fr/statistiques/serie/010534614","https://www.insee.fr/fr/statistiques/serie/010536462","https://www.insee.fr/fr/statistiques/serie/010534598","https://www.insee.fr/fr/statistiques/serie/010534252","https://www.insee.fr/fr/statistiques/serie/010534647","https://www.insee.fr/fr/statistiques/serie/010534662","https://www.insee.fr/fr/statistiques/serie/010534638","https://www.insee.fr/fr/statistiques/serie/010534253","https://www.insee.fr/fr/statistiques/serie/010534559","https://www.insee.fr/fr/statistiques/serie/010534606","https://www.insee.fr/fr/statistiques/serie/010534654","https://www.insee.fr/fr/statistiques/serie/010534645","https://www.insee.fr/fr/statistiques/serie/010534330","https://www.insee.fr/fr/statistiques/serie/010534696","https://www.insee.fr/fr/statistiques/serie/010534698","https://www.insee.fr/fr/statistiques/serie/010534702","https://www.insee.fr/fr/statistiques/serie/010535345","https://www.insee.fr/fr/statistiques/serie/010534180","https://www.insee.fr/fr/statistiques/serie/010534267","https://www.insee.fr/fr/statistiques/serie/010536480","https://www.insee.fr/fr/statistiques/serie/010534667","https://www.insee.fr/fr/statistiques/serie/001763781","https://www.insee.fr/fr/statistiques/serie/010534789","https://www.insee.fr/fr/statistiques/serie/010534784"]
[null,"Matériel","Travail","Travail activités spécialisées","GNR","Gazole","Frais divers","Transports routiers","Électricité vendue aux entreprises consommatrices finales","Fioul lourd","Gazole routier HTT","Tubes, tuyaux en matière plastique","Ensemble des produits du sciage","Béton prêt à l'emploi","Barres crénelées ou nervurées pour béton armé","Sables et granulats","Plaques, feuilles, tubes et profilés en matières plastiques","Ciment, chaux et plâtre","Produits explosifs","Acier pour la construction","Bitume","Produits de voierie en béton","Mortiers et bétons secs","Travaux de fonderie de fonte","Tuiles, briques et produits de construction en terre cuite","Tuyaux d'assainissement","Autres textiles n.c.a.","Matières plastiques sous formes primaires","Tubes, tuyaux, profilés creux et accessoires correspondants en acier","Éléments en béton pour la construction","Fils et câbles d'énergie","Moteurs, génératrices, transfo. électr., matér. distrib., cmde électr.","Matériel de distribution et de commande électrique","Appareils d'éclairage électrique","Câbles de fibres optiques","Peintures Industries","Produits sidérurgiques en acier non allié","Tôles quarto et autres produits plats en aciers non alliés de qualité","Éléments en métal pour la construction","Restaurants et hôtels","Traitement et élimination des déchets non dangereux","Collecte, traitement et élimination des déchets ; récupération de matériaux"]
["2017-10-01",103.7,116.9,114.5,105.6,107.57,101.4,105,96,{"$f":"'Fioul lourd'!C2","v":100},{"$f":"'Gazole routier HTT'!C2","v":100},98.7,104,99.2,null,98.8,100.6,98.2,101.6,null,null,97.7,97.3,92.3,100.2,101.9,105.8,103.3,105,96.8,97.5,101.1,100.3,96.8,106.1,104.3,113.3,null,101.8,102.92,105.9,103.5]
["2017-11-01",103.5,117.3,114.7,109.1,110.15,101.1,105,102.6,{"$f":"'Fioul lourd'!C3","v":109.16469394656747},{"$f":"'Gazole routier HTT'!C3","v":109.16469394656747},99,104.1,99.1,null,98.9,101.2,98.2,101.2,null,null,97.2,97.2,91.9,99.7,101.7,105.7,102.6,103.7,96.2,97.7,101.1,100.3,96.6,106,104,110,null,101.8,102.81,105.4,104.5]
["2017-12-01",103.6,117.8,114.9,109.5,110.61,101.9,105.6,107,{"$f":"'Fioul lourd'!C4","v":108.1501521812648},{"$f":"'Gazole routier HTT'!C4","v":108.1501521812648},98.6,104.2,98.8,null,98.7,101.1,97.6,100.9,null,null,97,96,90.6,98.8,105,105.7,103.5,104.3,96.1,98.4,101.3,100.1,96.9,105.8,103.9,112.3,null,102.3,103.04,104,103]
["2018-01-01",104.1,117.8,115.1,119.2,120.07,101.5,105.6,108.5,{"$f":"'Fioul lourd'!C5","v":109.87487318227933},{"$f":"'Gazole routier HTT'!C5","v":109.87487318227933},98.8,106.4,99.6,127.8,99,101.2,100.7,104.5,123.2,123.3,97.4,97.3,91.9,100.2,103.8,105.5,104.3,104.6,96.7,99.4,101.8,100.7,97.2,106,104.7,115.9,103.9,102.7,103.76,105.9,104.1]
["2018-02-01",103.8,117.8,115.3,116.2,119.28,101.8,105.6,111.8,{"$f":"'Fioul lourd'!C6","v":108.55596888738587},{"$f":"'Gazole routier HTT'!C6","v":108.55596888738587},99.6,106.5,99.4,128.5,99.4,101.2,99.9,102.7,124.1,124,98.6,97.7,92,100.7,99.7,105.5,105.6,105.9,97.6,99.5,101.5,100.4,96.6,106,105.4,116.2,103.6,102.4,103.35,105.6,104.2]
["2018-03-01",104.1,117.7,115.4,117.4,118.6,102.2,107.6,111.6,{"$f":"'Fioul lourd'!C7","v":103.55089617855936},{"$f":"'Gazole routier HTT'!C7","v":103.55089617855936},100.2,106.5,100.2,130.30000000000001,99.4,101.5,99.4,104.2,125.9,119,98.5,98.4,92.6,99.6,99.3,105.4,105.4,104.8,97.3,99.9,101.6,100.5,97.6,106.4,106.1,117.2,103.4,102.9,105.4,106.4,105.5]
["2018-04-01",104.3,118,115.8,122.8,121.2,102.6,107.6,106.3,{"$f":"'Fioul lourd'!C8","v":109.90869124112277},{"$f":"'Gazole routier HTT'!C8","v":109.90869124112277},100.2,108.5,101,131.1,100.3,101.3,99,102,126.4,121.1,97.9,99,93.3,100.6,99.1,105.3,103.7,108.9,97.2,100.1,101.5,100.4,98,107,106.8,115.7,104.2,103.3,103.76,106.6,105.6]
["2018-05-01",104.5,118.2,116.1,126.7,125.69,102.2,107.6,102.3,{"$f":"'Fioul lourd'!C9","v":114.23740277308083},{"$f":"'Gazole routier HTT'!C9","v":114.23740277308083},101.1,108.6,101.8,130.19999999999999,100.9,102.5,99.9,103.6,125.8,130,98.8,99,93.7,100.8,100.9,105.3,104.7,108.6,97.6,98.9,101.6,100.4,96.7,107.2,104.8,117.5,104.6,103.3,104.42,107.7,106.2]
["2018-06-01",104.6,118.4,116.5,125.4,126.87,102.1,108.1,97,{"$f":"'Fioul lourd'!C10","v":129.52316537030777},{"$f":"'Gazole routier HTT'!C10","v":129.52316537030777},99.8,108.6,101.7,128,100.1,101.8,98.1,103.9,125.4,148.9,98.3,98.9,94.4,100.9,100.8,105.3,106.2,109.7,97.7,98.6,101.7,100.3,99.3,108.8,103.8,116.9,104.1,102.9,105.67,107.1,106.6]
["2018-07-01",104.6,118.7,116.8,125.4,125.44,103.7,108.1,96.8,{"$f":"'Fioul lourd'!C11","v":132.53297260737236},{"$f":"'Gazole routier HTT'!C11","v":132.53297260737236},99.4,109,101.9,126.1,100,101.9,99.1,103,124.1,151.19999999999999,97.7,98.2,93.3,101,103.2,105.4,106.8,112.1,97.5,98.7,101.6,100.1,98,108.3,103.8,116.2,104.7,103.3,108.39,107.4,106.5]
["2018-08-01",104.6,119.1,117.1,126.4,125.67,103.9,108.1,98.3,{"$f":"'Fioul lourd'!C12","v":131.01115995941836},{"$f":"'Gazole routier HTT'!C12","v":131.01115995941836},99.9,109,102.7,128,100.4,101.6,99.2,103.2,124.6,154.6,98.2,98.6,94.1,102.1,102.9,105.4,107.3,112,97.9,100,101.5,100,98.1,108.4,103.7,116.6,104.9,103.1,110.86,106.8,104.9]
["2018-09-01",104.6,119.5,117.4,128.69999999999999,127.96,101.9,108.2,98.6,{"$f":"'Fioul lourd'!C13","v":132.80351707811977},{"$f":"'Gazole routier HTT'!C13","v":132.80351707811977},100.8,109.1,101.8,129.1,100.1,102.9,99.4,103.4,124.8,155.19999999999999,97.6,99.2,94.1,101.5,105.6,105.1,107.3,112.6,98.5,97.7,101.2,99.6,98.8,109,104.5,117.1,105.7,102.9,106.03,108.4,105.5]
["2018-10-01",104.3,119.7,117.8,132.80000000000001,131.94999999999999,102.6,108.2,99.3,{"$f":"'Fioul lourd'!C14","v":145.48528914440317},{"$f":"'Gazole routier HTT'!C14","v":145.48528914440317},101.6,109.4,102.2,127.8,100,102.8,99.7,103,123.6,159.4,97.4,98.6,93.9,100.7,105.3,106.9,108,109.1,98.3,97.1,100.9,99.4,97.4,109.1,106.5,117.2,105.2,103.4,105.44,107.1,104]
["2018-11-01",104.3,120,118.2,125.8,128.44,101.8,108.2,105.7,{"$f":"'Fioul lourd'!C15","v":128.84680419343934},{"$f":"'Gazole routier HTT'!C15","v":128.84680419343934},101.1,109.3,102.4,126.6,100.1,102.2,98.8,103,123.3,170.6,98.1,97.3,94.3,100,102.2,106.8,109,110.3,98.3,97.2,101.2,99.5,97.7,109.1,105.6,116.6,104.9,103.4,105.09,106.4,103.6]
["2018-12-01",104.1,120.2,118.6,118.1,123.19,102.7,108.2,111.6,{"$f":"'Fioul lourd'!C16","v":110.04396347649647},{"$f":"'Gazole routier HTT'!C16","v":110.04396347649647},101,109.5,102.2,125.5,99,102.1,99.6,103.5,122.6,154,98,95.3,95.3,99.9,102.5,106.8,106.6,104,98,97,101.1,99.4,97.2,108.9,104.2,116.1,104.4,103.5,104.99,107.1,104.1]
["2019-01-01",104.7,120.8,118.8,118.2,121.15,102.3,108.2,115.3,{"$f":"'Fioul lourd'!C17","v":111.83632059519786},{"$f":"'Gazole routier HTT'!C17","v":111.83632059519786},101.1,109.6,103.8,124.6,101,101.6,104,103.3,123.3,135.80000000000001,98.6,99.1,95,100.2,102.6,107,104,107,99.1,97.2,102.4,101.4,99,108.3,107.8,115.8,102.7,104.1,105.77,107.7,103]
["2019-02-01",104.7,121.4,118.9,122.5,124.46,102.7,108.2,123.6,{"$f":"'Fioul lourd'!C18","v":125.83699695637475},{"$f":"'Gazole routier HTT'!C18","v":125.83699695637475},100.8,109.7,104.2,123.8,101.1,101,103.5,103.5,122,140.5,99.9,99,94,102,103.3,107.4,104.4,108,100.1,97.2,102.4,101.3,97.3,108.1,107.4,114.9,102.9,105.9,105.16,108.1,102.8]
["2019-03-01",105.7,122,119.1,123.5,126.59,102.5,109,125.6,{"$f":"'Fioul lourd'!C19","v":128.77916807575249},{"$f":"'Gazole routier HTT'!C19","v":128.77916807575249},100.4,109.6,104.3,123.9,101,100.8,102.6,103.4,121.8,153.30000000000001,100.4,97.9,94.1,101.1,104.8,107.7,104.8,106.6,100,97.4,102.2,101.2,99.8,108.3,107.3,115.4,102.7,105.9,105.83,108.7,103.8]
["2019-04-01",105.3,122.3,119.2,125.8,127.27,103.4,109,119.5,{"$f":"'Fioul lourd'!C20","v":132.80351707811977},{"$f":"'Gazole routier HTT'!C20","v":132.80351707811977},98.8,109.7,104.1,123.8,101.8,99.9,102.3,103.3,122.1,157,100.5,99.2,94,101.5,106,108,105.4,107.4,100.6,98.9,102.3,101.3,101.4,108.6,106.8,115.2,101.5,106.2,105.72,108.5,103.2]
["2019-05-01",105,122.5,119.3,126.4,128.47999999999999,102.8,109,107.4,{"$f":"'Fioul lourd'!C21","v":129.21880284071699},{"$f":"'Gazole routier HTT'!C21","v":129.21880284071699},99,109.7,104.9,123,101.9,101.1,101.5,103.3,120.4,161.80000000000001,101.8,100.1,94.8,101.4,105.5,108,107.6,107,100.8,98.1,102.3,101,101.5,107.7,106.4,114.4,102.5,106.2,106.04,108.7,102.9]
["2019-06-01",104.9,122.7,119.4,119.9,123.57,103.6,110.1,103.3,{"$f":"'Fioul lourd'!C22","v":117.65302671626651},{"$f":"'Gazole routier HTT'!C22","v":117.65302671626651},99.5,109.8,105.3,122,101.4,100.6,102,103.3,118.8,158.4,101.5,100.1,95.1,101.9,104.6,108,105.6,107.9,100.9,96.4,102.3,101,99.9,107.9,108.2,115.2,101.4,106.2,107.32,108.7,102.4]
["2019-07-01",105,122.9,119.6,121.5,123.15,104.9,110.1,104.2,{"$f":"'Fioul lourd'!C23","v":126.91917483936426},{"$f":"'Gazole routier HTT'!C23","v":126.91917483936426},101.2,107.8,105.4,120.5,101.5,100.5,102,103.2,118.7,151.69999999999999,101.6,100.3,95.1,101.7,105,108.5,101.9,106.6,101,95.2,102.6,101.2,98.5,107.9,106.8,113.1,99,106.7,110.03,109.1,101.2]
["2019-08-01",105.1,123.1,119.8,119.9,122.39,104.9,110.1,106.7,{"$f":"'Fioul lourd'!C24","v":103.07744335475147},{"$f":"'Gazole routier HTT'!C24","v":103.07744335475147},100.7,107.8,106.7,119.8,101.4,99.9,102.1,102.7,116.4,154.19999999999999,102.4,100.5,94.9,102.6,107.1,108.6,101,107,101.7,94.1,103,101.7,98,107.9,110.7,112.6,100.2,106.6,111.71,109.1,100.7]
["2019-09-01",105.7,123.3,119.9,123.3,124.29,103.1,110.1,107,{"$f":"'Fioul lourd'!C25","v":115.59012512681774},{"$f":"'Gazole routier HTT'!C25","v":115.59012512681774},98.9,107.8,105.2,118.3,101.4,99.5,101.8,102.1,116.4,140.9,101.6,100.9,95.5,101.8,106.4,108.5,100.8,108.3,101.5,94.1,103.2,101.9,98.2,108,108,111.1,99.3,107.1,107.75,108.7,100.7]
["2019-10-01",105.6,123.5,120,122.4,124.77,103.7,110.1,109,{"$f":"'Fioul lourd'!C26","v":98.647277646263106},{"$f":"'Gazole routier HTT'!C26","v":98.647277646263106},99.7,107.8,104.7,114.1,101.2,99.2,101.4,104.1,111.7,147,101.5,99.8,95.4,101.3,106.5,108,100.3,108.5,101.3,92.2,103.1,101.8,97,107.7,109.9,109.9,96.9,107.6,106.93,109.2,97.8]
["2019-11-01",105.1,123.7,120,122.5,124.82,103.3,110.1,118.1,{"$f":"'Fioul lourd'!C27","v":89.888400405816711},{"$f":"'Gazole routier HTT'!C27","v":89.888400405816711},99.9,107.8,104.5,111.3,101,98.8,101.7,104.2,109.4,131.69999999999999,101.3,98.4,94.5,101.2,106.5,108.1,97.8,109.2,101.6,94.6,103.2,101.8,96.3,107.6,109,108.5,93.9,107.4,106.27,109.2,98.1]
["2019-12-01",104.6,123.9,120.1,124.1,126.67,104,110.5,125,{"$f":"'Fioul lourd'!C28","v":86.608048698004751},{"$f":"'Gazole routier HTT'!C28","v":86.608048698004751},101.2,107.8,104.8,111.2,100.7,98.4,101.8,104.4,108.4,126.8,101.5,98,95.2,100.2,104.8,108,97.3,107.8,101.5,95.5,103.1,101.6,96.2,107.2,108.1,107.1,92,108.5,106.62,108.9,98.4]
["2020-01-01",104.7,123.7,120.1,120.9,127.51,103.4,110.5,129.69999999999999,{"$f":"'Fioul lourd'!C29","v":96.41528576259725},{"$f":"'Gazole routier HTT'!C29","v":96.41528576259725},100.4,107.1,105.2,112.6,101.7,97.7,103.4,103.3,110,141.9,101.8,100.7,94.2,101.6,103.5,108.1,96,106,102.5,96,104.2,103,96.4,107,110.4,107.8,93.5,108.6,107.52,112.1,100.4]
["2020-02-01",105.5,123.5,120.2,115.3,121.26,103.9,110.5,131.69999999999999,{"$f":"'Fioul lourd'!C30","v":93.878931349340561},{"$f":"'Gazole routier HTT'!C30","v":93.878931349340561},100.2,106.9,103.7,113.5,102.5,97.1,103,103.6,111,151.30000000000001,105.1,100.8,93.7,102.2,104.3,108.6,97.1,105.2,103.3,96.2,104.3,103.1,96.6,107.2,108.9,105.6,92.4,108.6,107.05,112.1,99.5]
["2020-03-01",105.3,123.3,120.3,99.2,112.7,103.2,111.4,129.1,{"$f":"'Fioul lourd'!C31","v":67.568481569157939},{"$f":"'Gazole routier HTT'!C31","v":67.568481569157939},100.8,107,103.5,112.3,102.4,97.3,104.4,103.6,110.5,146.19999999999999,104.3,98.4,94.6,102.5,103.8,108.6,95.9,106,103.4,96.1,103.7,102.3,96.7,107,109.9,106.1,91.3,108.8,107.38,112.9,100]
["2020-04-01",105.5,123.6,120.8,88.2,105.41,102.7,111.4,124.2,{"$f":"'Fioul lourd'!C32","v":50.96381467703754},{"$f":"'Gazole routier HTT'!C32","v":50.96381467703754},100.7,106.4,102.7,112.1,103.8,98.1,101.8,104.5,110.4,113.5,104.8,102.2,93.5,104.1,102.3,108.6,90.4,105.5,103.6,95.6,102.8,102.2,97.1,106.8,111.3,106.2,91.4,109.2,106.44,113.3,99.6]
["2020-05-01",104.9,123.8,121.4,91.2,101.14,103.1,111.4,113.8,{"$f":"'Fioul lourd'!C33","v":55.393980385525879},{"$f":"'Gazole routier HTT'!C33","v":55.393980385525879},100.3,106.5,104.4,111.3,104.3,96,102,104.5,109.1,109.9,104.5,102,94.3,103.5,102.9,108.5,84.5,106,103.9,95,102.9,102.4,96.1,107.1,110.1,107.9,95.1,109.1,107.23,112.6,100.4]
["2020-06-01",103,124,121.9,97.2,104.55,104,107.5,107.3,{"$f":"'Fioul lourd'!C34","v":74.737910043963481},{"$f":"'Gazole routier HTT'!C34","v":74.737910043963481},99.7,106.5,105.4,109.7,103.3,94.2,102.5,104.4,108,120.6,105.4,100.9,95.3,103.9,103,108.6,86.1,104.9,104,92.8,103.1,102.9,98.1,106.6,109.4,106.3,92.9,109.1,108.12,112.5,99.5]
["2020-07-01",102.6,123.8,122.1,99.7,107.19,104.6,107.5,106.2,{"$f":"'Fioul lourd'!C35","v":76.962703249756942},{"$f":"'Gazole routier HTT'!C35","v":76.962703249756942},99.7,106.9,105.6,108,103.2,94.1,102,104.3,106.8,147.80000000000001,105.7,100.8,93.7,103.9,102.9,108.6,89.7,104.9,103.6,93.5,103.3,103.5,98.1,106.4,111.5,104.6,91.6,109.5,110.6,112.7,98.3]
["2020-08-01",102.8,123.7,122.4,98.3,106.73,104.6,107.5,108.2,{"$f":"'Fioul lourd'!C36","v":78.186081416283741},{"$f":"'Gazole routier HTT'!C36","v":78.186081416283741},100.8,106.9,105.4,107.4,103.1,95.9,102.1,104.7,106.8,146.19999999999999,104.7,100.6,93.1,104.4,102.7,108.7,90.3,103.7,102.7,95.5,104.4,105.5,98.2,106,111.6,104.4,88.5,109.4,113.33,110.5,97.7]
["2020-09-01",104.4,123.6,122.6,94.9,104.23,103,108.8,108.6,{"$f":"'Fioul lourd'!C37","v":75.797826992740568},{"$f":"'Gazole routier HTT'!C37","v":75.797826992740568},97.3,106.9,106.5,108.5,103.1,95,101.9,104,107,142.6,105,100.4,94.4,103.3,102.8,108.6,90.4,104.2,103.2,95.8,103.9,104.8,98.4,105.9,113,104.3,90.7,109.7,108.06,111.1,101.1]
["2020-10-01",104.1,123.5,122.9,95,103.91,102.4,108.8,109.8,{"$f":"'Fioul lourd'!C38","v":77.969280222215701},{"$f":"'Gazole routier HTT'!C38","v":77.969280222215701},97.3,109,105.9,110.7,103,95.4,101.6,103.9,108.7,130.5,104.4,100.4,93.8,103.2,101.9,108.6,90.5,107,102.6,95.8,103.7,104.2,98.3,106,113.3,105.3,93.6,109.4,107.21,110.9,99]
["2020-11-01",104.4,123.5,123.2,96.6,104.72,102.6,108.8,116.4,{"$f":"'Fioul lourd'!C39","v":80.93739180767102},{"$f":"'Gazole routier HTT'!C39","v":80.93739180767102},98.4,108.9,105.4,112.6,102.8,94.9,102.8,104.3,108.9,126.3,103.9,99.6,93.6,102.7,102.1,108.6,93.4,107.1,102.4,96.4,103.6,103.8,98.7,105.8,113.1,106.4,95.3,109.4,106.81,110.5,99.5]
["2020-12-01",104.4,123.4,123.4,101.2,108.63,103.7,108.8,128,{"$f":"'Fioul lourd'!C40","v":84.005300768173541},{"$f":"'Gazole routier HTT'!C40","v":84.005300768173541},98.9,108.8,104.7,116.1,101.8,95.8,103.2,104.5,110.8,128.5,106.6,96.4,93.7,102.4,103,108.6,97.2,107.3,102.9,97.5,103.8,104,98.5,105.8,108.9,106.9,96.3,110,106.73,110.6,103.5]
["2021-01-01",104.5,123.4,123.6,104.6,111.52,103.3,108.8,133.30000000000001,{"$f":"'Fioul lourd'!C41","v":87.475840517659549},{"$f":"'Gazole routier HTT'!C41","v":87.475840517659549},98.9,114.6,105.8,130.80000000000001,104.3,96.9,105.7,102.7,123,135.69999999999999,107.4,101.6,94.4,102,103.5,107.4,101.4,108.3,103.6,99.2,104.5,105.3,98.5,105.1,111.4,114.6,106.2,110.7,107.3,117.1,111.7]
["2021-02-01",104.5,123.3,123.7,109.6,115.5,103.6,108.8,137.69999999999999,{"$f":"'Fioul lourd'!C42","v":96.424912028356985},{"$f":"'Gazole routier HTT'!C42","v":96.424912028356985},100.5,114.7,105.9,139.19999999999999,104,98.4,105.7,102.6,133.69999999999999,142.80000000000001,106.9,101.2,95.3,102.7,105.7,107.6,107.2,110.8,103.8,101,104.8,105.5,98.3,105.3,108.6,123.1,113.7,111.3,107.01,117.5,111.9]
["2021-03-01",107.6,123.3,123.9,111.5,118.85,103.4,109.5,136.1,{"$f":"'Fioul lourd'!C43","v":99.707901538530166},{"$f":"'Gazole routier HTT'!C43","v":99.707901538530166},101.2,114.7,106.2,144.6,104.8,101.6,104.5,103.5,140.6,152.1,109,101.2,94.4,103.6,106.3,108,120.4,110.8,105.2,104.2,104.7,105.3,97.9,105.1,108.6,123.6,116.9,110.6,107.86,117.6,117.1]
["2021-04-01",107.8,123,123.6,110.9,117.92,103.5,109.5,130.69999999999999,{"$f":"'Fioul lourd'!C44","v":97.252541983489749},{"$f":"'Gazole routier HTT'!C44","v":97.252541983489749},104.9,122.9,106.4,149.4,104.2,108.1,103.6,103.9,145.80000000000001,157.80000000000001,109.7,101.6,97.5,103.4,106.5,107.8,134.69999999999999,112.9,104.7,108.4,104.8,105.3,95.6,105.5,109.3,126.1,133.30000000000001,112.6,107.33,117.8,117.6]
["2021-05-01",107.2,122.7,123.3,112.9,119.24,104.4,109.5,119.4,{"$f":"'Fioul lourd'!C45","v":96.963473724732353},{"$f":"'Gazole routier HTT'!C45","v":96.963473724732353},107.6,123.5,106,153.5,104.1,111.7,103.4,104,147.9,156.1,108.6,101.3,98.2,105.2,109.1,107.7,139.30000000000001,113.4,105.1,111.4,104.5,105.3,97.5,103.3,111.3,127.8,137.6,113.4,107.21,117.9,119.1]
["2021-06-01",107.8,122.5,123,117.1,121.32,105,110.6,111,{"$f":"'Fioul lourd'!C46","v":100.23097743532924},{"$f":"'Gazole routier HTT'!C46","v":100.23097743532924},115.2,123.9,105.6,167.7,104.1,116.7,103.9,104.3,161.4,156.6,106.8,101.1,99.3,104.4,110.1,107.9,137.19999999999999,114.2,104.8,116.4,104.7,105.5,96.8,102.4,113.3,136.9,144.6,115.2,108.37,118.1,122.4]
["2021-07-01",108.3,{"$f":"C50","v":122.5},123.1,120.9,123.71,106.6,110.6,111.9,{"$f":"'Fioul lourd'!C47","v":104.68228449131354},{"$f":"'Gazole routier HTT'!C47","v":104.68228449131354},120.6,136.6,106.7,185.7,104.1,118.8,104.1,104.8,179.7,165.2,109,101.8,100.8,104.4,111.4,108.3,137.80000000000001,115.3,104.9,120.2,105.6,106.3,97.2,101.9,114.1,143.6,168.9,117.8,110.94,118.1,123.2]
["2021-08-01",108.2,122.6,123.1,122.5,122.96,106.7,110.6,111.4,{"$f":"'Fioul lourd'!C48","v":101.94645989950256},{"$f":"'Gazole routier HTT'!C48","v":103.58316482349619},122.3,136.80000000000001,108.3,191.7,104.9,121.1,105.1,104.6,185.8,167.9,109.5,101,101.4,105.5,110.8,108.5,136.4,114.2,105.1,122.4,106.1,107,95.2,103.2,120.7,146.9,171.2,120.1,113.93,118.3,124.3]
["2021-09-01",108.6,122.7,123.1,123.3,124.37,105.4,110.5,111.5,{"$f":"'Fioul lourd'!C49","v":107.17033628990391},{"$f":"'Gazole routier HTT'!C49","v":105.88777057859708},123.4,137.30000000000001,105.5,196.7,104.6,120.7,106,104.5,195.4,173.6,110,103.2,103.6,105.3,112.3,108.6,136.80000000000001,117.8,105.9,124,106.3,106.8,96.5,102.4,118.7,150,179.6,121.4,110.01,118.2,123.4]
["2021-10-01",109,{"$f":"C53","v":122.7},{"$f":"D53","v":123.1},133,132.38,105.8,110.5,112.2,{"$f":"'Fioul lourd'!C50","v":116.10564264542242},{"$f":"'Gazole routier HTT'!C50","v":119.53812774342542},124.6,137.4,106.4,193,103.4,121.3,106.6,104.2,191.5,183.7,111.4,103.2,105.6,105.6,112.3,109,140.4,120.6,106.2,124,106.9,107.3,97,101.7,121,150.69999999999999,186.8,121.8,109.17,118.3,114.9]
["2021-11-01",null,null,null,131.9,133.69999999999999,null,null,120.7,null,null,125.8,137.4,106.8,193.5,103.6,124.3,107,106,192.3,198.8,112.5,null,107.4,105.6,null,109.8,146,119.5,107,null,107.1,107.7,97,101.6,125.6,150.5,183.9,122.7,109.06,118.6,116.3]
["2021-12-01",null,null,null,127.4,131.08000000000001,null,null,136.69999999999999,null,null,124.7,137.30000000000001,107.1,193.4,102.9,123.4,108.5,105.8,192.5,187,null,null,104.7,105,null,110,146.1,121.6,107.2,null,107.5,107.7,97,101.7,120.4,1505,182.1,123.9,109.24,null,118.4]
["equiv mois à mois",null,1,1,null,null,null,null,null,null,null,null,null,null,null,null,null,null,null,null,null,null,null,null,null,1,null,null,null,null,1]
[]
["equiv mois à mois","Travail","Travail activités spécialisées","Fils et câbles d'énergie","Tuyaux d'assainissement","Matériel de distribution et de commande électrique",null,null,null,"Travail activités spécialisées",{"$f":"MAX(C61:C66)","v":1}]
[null,{"$f":"HLOOKUP(B59,'Composition index'!$A$2:$AR$3,2,FALSE)","v":"5540998"},{"$f":"HLOOKUP(C59,'Composition index'!$A$2:$AR$3,2,FALSE)","v":"001565195"},{"$f":"HLOOKUP(D59,'Composition index'!$A$2:$AR$3,2,FALSE)","v":"010534330"},{"$f":"HLOOKUP(E59,'Composition index'!$A$2:$AR$3,2,FALSE)","v":"010534253"},{"$f":"HLOOKUP(F59,'Composition index'!$A$2:$AR$3,2,FALSE)","v":"010534698"},{"$f":"TEXT(date,\"mmmm\")","v":"octobre"},{"$f":"IF(OR(G60=\"août\",G60=\"octobre\"),\"d'\"&G60,\"de \"&G60)","v":"d'octobre"},null,"Fils et câbles d'énergie",{"$f":"MAX(D61:D66)","v":1}]
["TP03a",{"$f":"SUM(IF((INDEX(base_indices,1,)=B$60)*(INDEX(base_indices,,1)=$A$59),INDEX(base_indices,,),0))","v":1},{"$f":"SUM(IF((INDEX(base_indices,1,)=C$60)*(INDEX(base_indices,,1)=$A$59),INDEX(base_indices,,),0))","v":1},null,null,null,{"$f":"TEXT(EDATE(date,-1),\"mmmm\")","v":"septembre"},{"$f":"IF(G61=\"août\",\"d'\"&G61,\"de \"&G61)","v":"de septembre"},null,"Tuyaux d'assainissement",{"$f":"MAX(E61:E66)","v":1}]
["TP03b",null,{"$f":"SUM(IF((INDEX(base_indices,1,)=C$60)*(INDEX(base_indices,,1)=$A$59),INDEX(base_indices,,),0))","v":1},null,null,null,{"$f":"TEXT(EDATE(date,-2),\"mmmm\")","v":"août"},{"$f":"IF(G62=\"août\",\"d'\"&G62,\"de \"&G62)","v":"d'août"},null,"Travail",{"$f":"MAX(B61:B66)","v":1}]
["TP12d",null,{"$f":"SUM(IF((INDEX(base_indices,1,)=C$60)*(INDEX(base_indices,,1)=$A$59),INDEX(base_indices,,),0))","v":1},null,null,{"$f":"SUM(IF((INDEX(base_indices,1,)=F$60)*(INDEX(base_indices,,1)=$A$59),INDEX(base_indices,,),0))","v":0},null,null,null,"Matériel de distribution et de commande électrique",{"$f":"MAX(F61:F66)","v":0}]
["TP12a",null,null,{"$f":"SUM(IF((INDEX(base_indices,1,)=D$60)*(INDEX(base_indices,,1)=$A$59),INDEX(base_indices,,),0))","v":1}]
["TP12b",null,null,{"$f":"SUM(IF((INDEX(base_indices,1,)=D$60)*(INDEX(base_indices,,1)=$A$59),INDEX(base_indices,,),0))","v":1}]
["TP10a",null,null,null,{"$f":"SUM(IF((INDEX(base_indices,1,)=E$60)*(INDEX(base_indices,,1)=$A$59),INDEX(base_indices,,),0))","v":1}]
[]
[]
["TP03a",{"$f":"IF(C61=\"\",\"\",IF(C61=0,\"\",IF(C61=1,\"Pour l'indice \"&C$59&\", la valeur \"&$H$60&\" est considérée comme équivalente à celle \"&$H$61&\" 2021\",IF(C61=2,\"Pour l'indice \"&C$59&\", les valeurs \"&$H$61&\" et\"&$H$60&\" sont considérées comme équivalentes à celle \"&$H$62))))","v":"Pour l'indice Travail activités spécialisées, la valeur d'octobre est considérée comme équivalente à celle de septembre 2021"}]
["TP03b",{"$f":"IF(C62=\"\",\"\",IF(C62=0,\"\",IF(C62=1,\"Pour l'indice \"&C$59&\", la valeur \"&$H$60&\" est considérée comme équivalente à celle \"&$H$61&\" 2021\",IF(C62=2,\"Pour l'indice \"&C$59&\", les valeurs \"&$H$61&\" et\"&$H$60&\" sont considérées comme équivalentes à celle \"&$H$62))))","v":"Pour l'indice Travail activités spécialisées, la valeur d'octobre est considérée comme équivalente à celle de septembre 2021"}]
["TP12d",{"$f":"IF(C63=\"\",\"\",IF(C63=0,\"\",IF(C63=1,\"Pour l'indice \"&C$59&\", la valeur \"&$H$60&\" est considérée comme équivalente à celle \"&$H$61&\" 2021\",IF(C63=2,\"Pour l'indice \"&C$59&\", les valeurs \"&$H$61&\" et\"&$H$60&\" sont considérées comme équivalentes à celle \"&$H$62))))","v":"Pour l'indice Travail activités spécialisées, la valeur d'octobre est considérée comme équivalente à celle de septembre 2021"}]
["TP12a",{"$f":"IF(D64=\"\",\"\",IF(D64=0,\"\",IF(D64=1,\"Pour l'indice \"&D$59&\", la valeur \"&$H$60&\" est considérée comme équivalente à celle \"&$H$61&\" 2021\",IF(D64=2,\"Pour l'indice \"&D$59&\", les valeurs \"&$H$61&\" et \"&$H$60&\" sont considérées comme équivalentes à celles \"&$H$62))))","v":"Pour l'indice Fils et câbles d'énergie, la valeur d'octobre est considérée comme équivalente à celle de septembre 2021"}]
["TP12b",{"$f":"IF(D65=\"\",\"\",IF(D65=0,\"\",IF(D65=1,\"Pour l'indice \"&D$59&\", la valeur \"&$H$60&\" est considérée comme équivalente à celle \"&$H$61&\" 2021\",IF(D65=2,\"Pour l'indice \"&D$59&\", les valeurs \"&$H$61&\" et \"&$H$60&\" sont considérées comme équivalentes à celles \"&$H$62))))","v":"Pour l'indice Fils et câbles d'énergie, la valeur d'octobre est considérée comme équivalente à celle de septembre 2021"}]
["TP10a",{"$f":"IF(E66=\"\",\"\",IF(E66=0,\"\",IF(E66=1,\"Pour l'indice \"&E$59&\", la valeur \"&$H$60&\" est considérée comme équivalente à celle \"&$H$61&\" 2021\",IF(E66=2,\"Pour l'indice \"&E$59&\", les valeurs \"&$H$61&\" et \"&$H$60&\" sont considérées comme équivalentes à celles \"&$H$62))))","v":"Pour l'indice Tuyaux d'assainissement, la valeur d'octobre est considérée comme équivalente à celle de septembre 2021"}]
["Tous les index",{"$f":"IF(B61=\"\",\"\",IF(B61=0,\"\",IF(B61=1,$G$60&\" 2021 = \"&$G$61&\" 2021\",IF(B61=2,$G$60&\" et \"&$G$61&\" 2021 = \"&$G$62&\" 2021\"))))","v":"octobre 2021 = septembre 2021"}]
[]
[null,{"$f":"\"Pour les indices suivants, les valeurs \"&$H$60&\" 2021 sont considérées comme équivalentes à celles \"&$H$61&\" 2021 :\"","v":"Pour les indices suivants, les valeurs d'octobre 2021 sont considérées comme équivalentes à celles de septembre 2021 :"}]
[null,{"$f":"B59&\", \"&C59&\", \"&D59&\", \"&E59","v":"Travail, Travail activités spécialisées, Fils et câbles d'énergie, Tuyaux d'assainissement"}]
[null,{"$f":"\"Pour les indices suivants, les valeurs \"&$H$60&\" 2021 sont considérées comme équivalentes à celles \"&$H$61&\" 2021 :\"","v":"Pour les indices suivants, les valeurs d'octobre 2021 sont considérées comme équivalentes à celles de septembre 2021 :"}]
[null,{"$f":"B59&\", \"&C59&\", \"&E59","v":"Travail, Travail activités spécialisées, Tuyaux d'assainissement"}]

{"sheet":"Indices 3-6 mois glissants","index":7,"n_rows":45,"n_cols":14,"rows_kept":45,"cut":false,"hidden":true,"merged":[]}
[null,null,null,{"$f":"EDATE(date,-5)","v":"2021-05-01"},{"$f":"DATE(2021,MONTH(date),1)","v":"2021-10-01"},{"$f":"EDATE(date,-11)","v":"2020-11-01"},{"$f":"EDATE(date,-6)","v":"2021-04-01"}]
[null,null,null,{"$f":"EDATE(date,-2)","v":"2021-08-01"},{"$f":"DATE(2021,MONTH(date),1)","v":"2021-10-01"},{"$f":"EDATE(date,-5)","v":"2021-05-01"},{"$f":"EDATE(date,-3)","v":"2021-07-01"}]
[]
[null,null,null,"3 mois","6 mois"]
[{"$f":"OFFSET('Indice prix'!$B$2,0,$G5)","v":"001711009"},{"$f":"OFFSET('Indice prix'!$B$5,0,$G5)","v":"Matériel"},{"$f":"OFFSET('Indice prix'!$B$4,0,$G5)","v":"https://www.insee.fr/fr/statistiques/serie/001711009"},{"$f":"SUM(IF((INDEX(base_indices,1,)=$A5)*(INDEX(base_indices,,1)>=$D$2)*(INDEX(base_indices,,1)<=$E$2),INDEX(base_indices,,),0))/SUM(IF((INDEX(base_indices,1,)=$A5)*(INDEX(base_indices,,1)>=$F$2)*(INDEX(base_indices,,1)<=$G$2),INDEX(base_indices,,),0))-1","v":7.7327559542221813E-3},{"$f":"SUM(IF((INDEX(base_indices,1,)=$A5)*(INDEX(base_indices,,1)>=$D$1)*(INDEX(base_indices,,1)<=$E$1),INDEX(base_indices,,),0))/SUM(IF((INDEX(base_indices,1,)=$A5)*(INDEX(base_indices,,1)>=$F$1)*(INDEX(base_indices,,1)<=$G$1),INDEX(base_indices,,),0))-1","v":2.5110549589387299E-2},null,0,null,{"$f":"_xlfn._xlws.SORT('Indices 3-6 mois glissants'!$A$5:$E$45,4,-1)","v":"010536480"},"Tôles quarto et autres produits plats en aciers non alliés de qualité","https://www.insee.fr/fr/statistiques/serie/010536480",0.19175349146530674,0.4941816533172132,{"$f":"IF(SUM(IF((INDEX(compo,3,)=I5)*(INDEX(compo,,1)='Evol indices 3-6 mois glissants'!$D$7),INDEX(compo,,),0))>0,\"x\",\"\")","v":""}]
[{"$f":"OFFSET('Indice prix'!$B$2,0,$G6)","v":"5540998"},{"$f":"OFFSET('Indice prix'!$B$5,0,$G6)","v":"Travail"},{"$f":"OFFSET('Indice prix'!$B$4,0,$G6)","v":"https://www.insee.fr/fr/statistiques/6020697"},{"$f":"SUM(IF((INDEX(base_indices,1,)=$A6)*(INDEX(base_indices,,1)>=$D$2)*(INDEX(base_indices,,1)<=$E$2),INDEX(base_indices,,),0))/SUM(IF((INDEX(base_indices,1,)=$A6)*(INDEX(base_indices,,1)>=$F$2)*(INDEX(base_indices,,1)<=$G$2),INDEX(base_indices,,),0))-1","v":8.1588251291808689E-4},{"$f":"SUM(IF((INDEX(base_indices,1,)=$A6)*(INDEX(base_indices,,1)>=$D$1)*(INDEX(base_indices,,1)<=$E$1),INDEX(base_indices,,),0))/SUM(IF((INDEX(base_indices,1,)=$A6)*(INDEX(base_indices,,1)>=$F$1)*(INDEX(base_indices,,1)<=$G$1),INDEX(base_indices,,),0))-1","v":-5.6764427625354275E-3},null,1,null,"010536462","Acier pour la construction","https://www.insee.fr/fr/statistiques/serie/010536462",0.17116564417177926,0.39184583114840055,{"$f":"IF(SUM(IF((INDEX(compo,3,)=I6)*(INDEX(compo,,1)='Evol indices 3-6 mois glissants'!$D$7),INDEX(compo,,),0))>0,\"x\",\"\")","v":""}]
[{"$f":"OFFSET('Indice prix'!$B$2,0,$G7)","v":"001565195"},{"$f":"OFFSET('Indice prix'!$B$5,0,$G7)","v":"Travail activités spécialisées"},{"$f":"OFFSET('Indice prix'!$B$4,0,$G7)","v":"https://www.insee.fr/fr/statistiques/serie/001565195"},{"$f":"SUM(IF((INDEX(base_indices,1,)=$A7)*(INDEX(base_indices,,1)>=$D$2)*(INDEX(base_indices,,1)<=$E$2),INDEX(base_indices,,),0))/SUM(IF((INDEX(base_indices,1,)=$A7)*(INDEX(base_indices,,1)>=$F$2)*(INDEX(base_indices,,1)<=$G$2),INDEX(base_indices,,),0))-1","v":-2.7070925825667391E-4},{"$f":"SUM(IF((INDEX(base_indices,1,)=$A7)*(INDEX(base_indices,,1)>=$D$1)*(INDEX(base_indices,,1)<=$E$1),INDEX(base_indices,,),0))/SUM(IF((INDEX(base_indices,1,)=$A7)*(INDEX(base_indices,,1)>=$F$1)*(INDEX(base_indices,,1)<=$G$1),INDEX(base_indices,,),0))-1","v":-3.6417588346372431E-3},null,2,null,"010546545","Barres crénelées ou nervurées pour béton armé","https://www.insee.fr/fr/statistiques/serie/010546545",0.14697178930755572,0.37290273747950042,{"$f":"IF(SUM(IF((INDEX(compo,3,)=I7)*(INDEX(compo,,1)='Evol indices 3-6 mois glissants'!$D$7),INDEX(compo,,),0))>0,\"x\",\"\")","v":"x"}]
[{"$f":"OFFSET('Indice prix'!$B$2,0,$G8)","v":"010534596"},{"$f":"OFFSET('Indice prix'!$B$5,0,$G8)","v":"GNR"},{"$f":"OFFSET('Indice prix'!$B$4,0,$G8)","v":"https://www.insee.fr/fr/statistiques/serie/010534596"},{"$f":"SUM(IF((INDEX(base_indices,1,)=$A8)*(INDEX(base_indices,,1)>=$D$2)*(INDEX(base_indices,,1)<=$E$2),INDEX(base_indices,,),0))/SUM(IF((INDEX(base_indices,1,)=$A8)*(INDEX(base_indices,,1)>=$F$2)*(INDEX(base_indices,,1)<=$G$2),INDEX(base_indices,,),0))-1","v":7.9509831860929081E-2},{"$f":"SUM(IF((INDEX(base_indices,1,)=$A8)*(INDEX(base_indices,,1)>=$D$1)*(INDEX(base_indices,,1)<=$E$1),INDEX(base_indices,,),0))/SUM(IF((INDEX(base_indices,1,)=$A8)*(INDEX(base_indices,,1)>=$F$1)*(INDEX(base_indices,,1)<=$G$1),INDEX(base_indices,,),0))-1","v":0.1502206809583857},null,3,null,"010534598","Bitume","https://www.insee.fr/fr/statistiques/serie/010534598",9.8974680895584921E-2,0.18963472485768484,{"$f":"IF(SUM(IF((INDEX(compo,3,)=I8)*(INDEX(compo,,1)='Evol indices 3-6 mois glissants'!$D$7),INDEX(compo,,),0))>0,\"x\",\"\")","v":""}]
[{"$f":"OFFSET('Indice prix'!$B$2,0,$G9)","v":"001764283"},{"$f":"OFFSET('Indice prix'!$B$5,0,$G9)","v":"Gazole"},{"$f":"OFFSET('Indice prix'!$B$4,0,$G9)","v":"https://www.insee.fr/fr/statistiques/serie/001764283"},{"$f":"SUM(IF((INDEX(base_indices,1,)=$A9)*(INDEX(base_indices,,1)>=$D$2)*(INDEX(base_indices,,1)<=$E$2),INDEX(base_indices,,),0))/SUM(IF((INDEX(base_indices,1,)=$A9)*(INDEX(base_indices,,1)>=$F$2)*(INDEX(base_indices,,1)<=$G$2),INDEX(base_indices,,),0))-1","v":4.2386142147308403E-2},{"$f":"SUM(IF((INDEX(base_indices,1,)=$A9)*(INDEX(base_indices,,1)>=$D$1)*(INDEX(base_indices,,1)<=$E$1),INDEX(base_indices,,),0))/SUM(IF((INDEX(base_indices,1,)=$A9)*(INDEX(base_indices,,1)>=$F$1)*(INDEX(base_indices,,1)<=$G$1),INDEX(base_indices,,),0))-1","v":9.8709277254334316E-2},null,4,null,"010534267","Produits sidérurgiques en acier non allié","https://www.insee.fr/fr/statistiques/serie/010534267",9.6252755326965422E-2,0.22149279292136415,{"$f":"IF(SUM(IF((INDEX(compo,3,)=I9)*(INDEX(compo,,1)='Evol indices 3-6 mois glissants'!$D$7),INDEX(compo,,),0))>0,\"x\",\"\")","v":""}]
[{"$f":"OFFSET('Indice prix'!$B$2,0,$G10)","v":"001711011"},{"$f":"OFFSET('Indice prix'!$B$5,0,$G10)","v":"Frais divers"},{"$f":"OFFSET('Indice prix'!$B$4,0,$G10)","v":"https://www.insee.fr/fr/statistiques/serie/001711011"},{"$f":"SUM(IF((INDEX(base_indices,1,)=$A10)*(INDEX(base_indices,,1)>=$D$2)*(INDEX(base_indices,,1)<=$E$2),INDEX(base_indices,,),0))/SUM(IF((INDEX(base_indices,1,)=$A10)*(INDEX(base_indices,,1)>=$F$2)*(INDEX(base_indices,,1)<=$G$2),INDEX(base_indices,,),0))-1","v":6.0126582278481333E-3},{"$f":"SUM(IF((INDEX(base_indices,1,)=$A10)*(INDEX(base_indices,,1)>=$D$1)*(INDEX(base_indices,,1)<=$E$1),INDEX(base_indices,,),0))/SUM(IF((INDEX(base_indices,1,)=$A10)*(INDEX(base_indices,,1)>=$F$1)*(INDEX(base_indices,,1)<=$G$1),INDEX(base_indices,,),0))-1","v":2.2254475084663605E-2},null,5,null,"Gazole routier HTT","Gazole routier HTT","https://www.fntp.fr/sites/default/files/content/indice_gazole_htt.pdf",8.987882897169519E-2,0.15588366430369271,{"$f":"IF(SUM(IF((INDEX(compo,3,)=I10)*(INDEX(compo,,1)='Evol indices 3-6 mois glissants'!$D$7),INDEX(compo,,),0))>0,\"x\",\"\")","v":""}]
[{"$f":"OFFSET('Indice prix'!$B$2,0,$G11)","v":"001711943"},{"$f":"OFFSET('Indice prix'!$B$5,0,$G11)","v":"Transports routiers"},{"$f":"OFFSET('Indice prix'!$B$4,0,$G11)","v":"https://www.insee.fr/fr/statistiques/serie/001711943"},{"$f":"SUM(IF((INDEX(base_indices,1,)=$A11)*(INDEX(base_indices,,1)>=$D$2)*(INDEX(base_indices,,1)<=$E$2),INDEX(base_indices,,),0))/SUM(IF((INDEX(base_indices,1,)=$A11)*(INDEX(base_indices,,1)>=$F$2)*(INDEX(base_indices,,1)<=$G$2),INDEX(base_indices,,),0))-1","v":2.721499848805653E-3},{"$f":"SUM(IF((INDEX(base_indices,1,)=$A11)*(INDEX(base_indices,,1)>=$D$1)*(INDEX(base_indices,,1)<=$E$1),INDEX(base_indices,,),0))/SUM(IF((INDEX(base_indices,1,)=$A11)*(INDEX(base_indices,,1)>=$F$1)*(INDEX(base_indices,,1)<=$G$1),INDEX(base_indices,,),0))-1","v":1.2381534698868712E-2},null,6,null,"010534596","GNR","https://www.insee.fr/fr/statistiques/serie/010534596",7.9509831860929081E-2,0.1502206809583857,{"$f":"IF(SUM(IF((INDEX(compo,3,)=I11)*(INDEX(compo,,1)='Evol indices 3-6 mois glissants'!$D$7),INDEX(compo,,),0))>0,\"x\",\"\")","v":""}]
[{"$f":"OFFSET('Indice prix'!$B$2,0,$G12)","v":"010534769"},{"$f":"OFFSET('Indice prix'!$B$5,0,$G12)","v":"Électricité vendue aux entreprises consommatrices finales"},{"$f":"OFFSET('Indice prix'!$B$4,0,$G12)","v":"https://www.insee.fr/fr/statistiques/serie/010534769"},{"$f":"SUM(IF((INDEX(base_indices,1,)=$A12)*(INDEX(base_indices,,1)>=$D$2)*(INDEX(base_indices,,1)<=$E$2),INDEX(base_indices,,),0))/SUM(IF((INDEX(base_indices,1,)=$A12)*(INDEX(base_indices,,1)>=$F$2)*(INDEX(base_indices,,1)<=$G$2),INDEX(base_indices,,),0))-1","v":-2.1034180543383019E-2},{"$f":"SUM(IF((INDEX(base_indices,1,)=$A12)*(INDEX(base_indices,,1)>=$D$1)*(INDEX(base_indices,,1)<=$E$1),INDEX(base_indices,,),0))/SUM(IF((INDEX(base_indices,1,)=$A12)*(INDEX(base_indices,,1)>=$F$1)*(INDEX(base_indices,,1)<=$G$1),INDEX(base_indices,,),0))-1","v":-0.13398107900792633},null,7,null,"010534207","Tubes, tuyaux en matière plastique","https://www.insee.fr/fr/statistiques/serie/010534207",7.8334304018637058E-2,0.18397478433974768,{"$f":"IF(SUM(IF((INDEX(compo,3,)=I12)*(INDEX(compo,,1)='Evol indices 3-6 mois glissants'!$D$7),INDEX(compo,,),0))>0,\"x\",\"\")","v":"x"}]
[{"$f":"OFFSET('Indice prix'!$B$2,0,$G13)","v":"Fioul lourd"},{"$f":"OFFSET('Indice prix'!$B$5,0,$G13)","v":"Fioul lourd"},{"$f":"OFFSET('Indice prix'!$B$4,0,$G13)","v":"https://www.fntp.fr/sites/default/files/content/indice_fioul_lourd.pdf"},{"$f":"SUM(IF((INDEX(base_indices,1,)=$A13)*(INDEX(base_indices,,1)>=$D$2)*(INDEX(base_indices,,1)<=$E$2),INDEX(base_indices,,),0))/SUM(IF((INDEX(base_indices,1,)=$A13)*(INDEX(base_indices,,1)>=$F$2)*(INDEX(base_indices,,1)<=$G$2),INDEX(base_indices,,),0))-1","v":7.7335218075283318E-2},{"$f":"SUM(IF((INDEX(base_indices,1,)=$A13)*(INDEX(base_indices,,1)>=$D$1)*(INDEX(base_indices,,1)<=$E$1),INDEX(base_indices,,),0))/SUM(IF((INDEX(base_indices,1,)=$A13)*(INDEX(base_indices,,1)>=$F$1)*(INDEX(base_indices,,1)<=$G$1),INDEX(base_indices,,),0))-1","v":0.14894596307166563},null,8,null,"Fioul lourd","Fioul lourd","https://www.fntp.fr/sites/default/files/content/indice_fioul_lourd.pdf",7.7335218075283318E-2,0.14894596307166563,{"$f":"IF(SUM(IF((INDEX(compo,3,)=I13)*(INDEX(compo,,1)='Evol indices 3-6 mois glissants'!$D$7),INDEX(compo,,),0))>0,\"x\",\"\")","v":""}]
[{"$f":"OFFSET('Indice prix'!$B$2,0,$G14)","v":"Gazole routier HTT"},{"$f":"OFFSET('Indice prix'!$B$5,0,$G14)","v":"Gazole routier HTT"},{"$f":"OFFSET('Indice prix'!$B$4,0,$G14)","v":"https://www.fntp.fr/sites/default/files/content/indice_gazole_htt.pdf"},{"$f":"SUM(IF((INDEX(base_indices,1,)=$A14)*(INDEX(base_indices,,1)>=$D$2)*(INDEX(base_indices,,1)<=$E$2),INDEX(base_indices,,),0))/SUM(IF((INDEX(base_indices,1,)=$A14)*(INDEX(base_indices,,1)>=$F$2)*(INDEX(base_indices,,1)<=$G$2),INDEX(base_indices,,),0))-1","v":8.987882897169519E-2},{"$f":"SUM(IF((INDEX(base_indices,1,)=$A14)*(INDEX(base_indices,,1)>=$D$1)*(INDEX(base_indices,,1)<=$E$1),INDEX(base_indices,,),0))/SUM(IF((INDEX(base_indices,1,)=$A14)*(INDEX(base_indices,,1)>=$F$1)*(INDEX(base_indices,,1)<=$G$1),INDEX(base_indices,,),0))-1","v":0.15588366430369271},null,9,null,"010534575","Ensemble des produits du sciage","https://www.insee.fr/fr/statistiques/serie/010534575",7.1614583333333259E-2,0.16199240432369266,{"$f":"IF(SUM(IF((INDEX(compo,3,)=I14)*(INDEX(compo,,1)='Evol indices 3-6 mois glissants'!$D$7),INDEX(compo,,),0))>0,\"x\",\"\")","v":"x"}]
[{"$f":"OFFSET('Indice prix'!$B$2,0,$G15)","v":"010534207"},{"$f":"OFFSET('Indice prix'!$B$5,0,$G15)","v":"Tubes, tuyaux en matière plastique"},{"$f":"OFFSET('Indice prix'!$B$4,0,$G15)","v":"https://www.insee.fr/fr/statistiques/serie/010534207"},{"$f":"SUM(IF((INDEX(base_indices,1,)=$A15)*(INDEX(base_indices,,1)>=$D$2)*(INDEX(base_indices,,1)<=$E$2),INDEX(base_indices,,),0))/SUM(IF((INDEX(base_indices,1,)=$A15)*(INDEX(base_indices,,1)>=$F$2)*(INDEX(base_indices,,1)<=$G$2),INDEX(base_indices,,),0))-1","v":7.8334304018637058E-2},{"$f":"SUM(IF((INDEX(base_indices,1,)=$A15)*(INDEX(base_indices,,1)>=$D$1)*(INDEX(base_indices,,1)<=$E$1),INDEX(base_indices,,),0))/SUM(IF((INDEX(base_indices,1,)=$A15)*(INDEX(base_indices,,1)>=$F$1)*(INDEX(base_indices,,1)<=$G$1),INDEX(base_indices,,),0))-1","v":0.18397478433974768},null,10,null,"010534330","Fils et câbles d'énergie","https://www.insee.fr/fr/statistiques/serie/010534330",6.4367816091953856E-2,0.18411076314488195,{"$f":"IF(SUM(IF((INDEX(compo,3,)=I15)*(INDEX(compo,,1)='Evol indices 3-6 mois glissants'!$D$7),INDEX(compo,,),0))>0,\"x\",\"\")","v":""}]
[{"$f":"OFFSET('Indice prix'!$B$2,0,$G16)","v":"010534575"},{"$f":"OFFSET('Indice prix'!$B$5,0,$G16)","v":"Ensemble des produits du sciage"},{"$f":"OFFSET('Indice prix'!$B$4,0,$G16)","v":"https://www.insee.fr/fr/statistiques/serie/010534575"},{"$f":"SUM(IF((INDEX(base_indices,1,)=$A16)*(INDEX(base_indices,,1)>=$D$2)*(INDEX(base_indices,,1)<=$E$2),INDEX(base_indices,,),0))/SUM(IF((INDEX(base_indices,1,)=$A16)*(INDEX(base_indices,,1)>=$F$2)*(INDEX(base_indices,,1)<=$G$2),INDEX(base_indices,,),0))-1","v":7.1614583333333259E-2},{"$f":"SUM(IF((INDEX(base_indices,1,)=$A16)*(INDEX(base_indices,,1)>=$D$1)*(INDEX(base_indices,,1)<=$E$1),INDEX(base_indices,,),0))/SUM(IF((INDEX(base_indices,1,)=$A16)*(INDEX(base_indices,,1)>=$F$1)*(INDEX(base_indices,,1)<=$G$1),INDEX(base_indices,,),0))-1","v":0.16199240432369266},null,11,null,"010534180","Peintures Industries","https://www.insee.fr/fr/statistiques/serie/010534180",6.4068497195157947E-2,5.9402939839369617E-2,{"$f":"IF(SUM(IF((INDEX(compo,3,)=I16)*(INDEX(compo,,1)='Evol indices 3-6 mois glissants'!$D$7),INDEX(compo,,),0))>0,\"x\",\"\")","v":""}]
[{"$f":"OFFSET('Indice prix'!$B$2,0,$G17)","v":"010534646"},{"$f":"OFFSET('Indice prix'!$B$5,0,$G17)","v":"Béton prêt à l'emploi"},{"$f":"OFFSET('Indice prix'!$B$4,0,$G17)","v":"https://www.insee.fr/fr/statistiques/serie/010534646"},{"$f":"SUM(IF((INDEX(base_indices,1,)=$A17)*(INDEX(base_indices,,1)>=$D$2)*(INDEX(base_indices,,1)<=$E$2),INDEX(base_indices,,),0))/SUM(IF((INDEX(base_indices,1,)=$A17)*(INDEX(base_indices,,1)>=$F$2)*(INDEX(base_indices,,1)<=$G$2),INDEX(base_indices,,),0))-1","v":5.969211435752575E-3},{"$f":"SUM(IF((INDEX(base_indices,1,)=$A17)*(INDEX(base_indices,,1)>=$D$1)*(INDEX(base_indices,,1)<=$E$1),INDEX(base_indices,,),0))/SUM(IF((INDEX(base_indices,1,)=$A17)*(INDEX(base_indices,,1)>=$F$1)*(INDEX(base_indices,,1)<=$G$1),INDEX(base_indices,,),0))-1","v":6.4627994955861467E-3},null,12,null,"010534667","Éléments en métal pour la construction","https://www.insee.fr/fr/statistiques/serie/010534667",4.878752886836013E-2,6.7860367138128153E-2,{"$f":"IF(SUM(IF((INDEX(compo,3,)=I17)*(INDEX(compo,,1)='Evol indices 3-6 mois glissants'!$D$7),INDEX(compo,,),0))>0,\"x\",\"\")","v":""}]
[{"$f":"OFFSET('Indice prix'!$B$2,0,$G18)","v":"010546545"},{"$f":"OFFSET('Indice prix'!$B$5,0,$G18)","v":"Barres crénelées ou nervurées pour béton armé"},{"$f":"OFFSET('Indice prix'!$B$4,0,$G18)","v":"https://www.insee.fr/fr/statistiques/serie/010546545"},{"$f":"SUM(IF((INDEX(base_indices,1,)=$A18)*(INDEX(base_indices,,1)>=$D$2)*(INDEX(base_indices,,1)<=$E$2),INDEX(base_indices,,),0))/SUM(IF((INDEX(base_indices,1,)=$A18)*(INDEX(base_indices,,1)>=$F$2)*(INDEX(base_indices,,1)<=$G$2),INDEX(base_indices,,),0))-1","v":0.14697178930755572},{"$f":"SUM(IF((INDEX(base_indices,1,)=$A18)*(INDEX(base_indices,,1)>=$D$1)*(INDEX(base_indices,,1)<=$E$1),INDEX(base_indices,,),0))/SUM(IF((INDEX(base_indices,1,)=$A18)*(INDEX(base_indices,,1)>=$F$1)*(INDEX(base_indices,,1)<=$G$1),INDEX(base_indices,,),0))-1","v":0.37290273747950042},null,13,null,"010534625","Plaques, feuilles, tubes et profilés en matières plastiques","https://www.insee.fr/fr/statistiques/serie/010534625",4.5794930875576068E-2,0.19237871411784435,{"$f":"IF(SUM(IF((INDEX(compo,3,)=I18)*(INDEX(compo,,1)='Evol indices 3-6 mois glissants'!$D$7),INDEX(compo,,),0))>0,\"x\",\"\")","v":""}]
[{"$f":"OFFSET('Indice prix'!$B$2,0,$G19)","v":"010536067"},{"$f":"OFFSET('Indice prix'!$B$5,0,$G19)","v":"Sables et granulats"},{"$f":"OFFSET('Indice prix'!$B$4,0,$G19)","v":"https://www.insee.fr/fr/statistiques/serie/010536067"},{"$f":"SUM(IF((INDEX(base_indices,1,)=$A19)*(INDEX(base_indices,,1)>=$D$2)*(INDEX(base_indices,,1)<=$E$2),INDEX(base_indices,,),0))/SUM(IF((INDEX(base_indices,1,)=$A19)*(INDEX(base_indices,,1)>=$F$2)*(INDEX(base_indices,,1)<=$G$2),INDEX(base_indices,,),0))-1","v":1.9212295869357465E-3},{"$f":"SUM(IF((INDEX(base_indices,1,)=$A19)*(INDEX(base_indices,,1)>=$D$1)*(INDEX(base_indices,,1)<=$E$1),INDEX(base_indices,,),0))/SUM(IF((INDEX(base_indices,1,)=$A19)*(INDEX(base_indices,,1)>=$F$1)*(INDEX(base_indices,,1)<=$G$1),INDEX(base_indices,,),0))-1","v":5.3063193439459866E-3},null,14,null,"001764283","Gazole","https://www.insee.fr/fr/statistiques/serie/001764283",4.2386142147308403E-2,9.8709277254334316E-2,{"$f":"IF(SUM(IF((INDEX(compo,3,)=I19)*(INDEX(compo,,1)='Evol indices 3-6 mois glissants'!$D$7),INDEX(compo,,),0))>0,\"x\",\"\")","v":""}]
[{"$f":"OFFSET('Indice prix'!$B$2,0,$G20)","v":"010534625"},{"$f":"OFFSET('Indice prix'!$B$5,0,$G20)","v":"Plaques, feuilles, tubes et profilés en matières plastiques"},{"$f":"OFFSET('Indice prix'!$B$4,0,$G20)","v":"https://www.insee.fr/fr/statistiques/serie/010534625"},{"$f":"SUM(IF((INDEX(base_indices,1,)=$A20)*(INDEX(base_indices,,1)>=$D$2)*(INDEX(base_indices,,1)<=$E$2),INDEX(base_indices,,),0))/SUM(IF((INDEX(base_indices,1,)=$A20)*(INDEX(base_indices,,1)>=$F$2)*(INDEX(base_indices,,1)<=$G$2),INDEX(base_indices,,),0))-1","v":4.5794930875576068E-2},{"$f":"SUM(IF((INDEX(base_indices,1,)=$A20)*(INDEX(base_indices,,1)>=$D$1)*(INDEX(base_indices,,1)<=$E$1),INDEX(base_indices,,),0))/SUM(IF((INDEX(base_indices,1,)=$A20)*(INDEX(base_indices,,1)>=$F$1)*(INDEX(base_indices,,1)<=$G$1),INDEX(base_indices,,),0))-1","v":0.19237871411784435},null,15,null,"010534662","Travaux de fonderie de fonte","https://www.insee.fr/fr/statistiques/serie/010534662",4.1233657391887446E-2,7.0311126735805862E-2,{"$f":"IF(SUM(IF((INDEX(compo,3,)=I20)*(INDEX(compo,,1)='Evol indices 3-6 mois glissants'!$D$7),INDEX(compo,,),0))>0,\"x\",\"\")","v":""}]
[{"$f":"OFFSET('Indice prix'!$B$2,0,$G21)","v":"010534642"},{"$f":"OFFSET('Indice prix'!$B$5,0,$G21)","v":"Ciment, chaux et plâtre"},{"$f":"OFFSET('Indice prix'!$B$4,0,$G21)","v":"https://www.insee.fr/fr/statistiques/serie/010534642"},{"$f":"SUM(IF((INDEX(base_indices,1,)=$A21)*(INDEX(base_indices,,1)>=$D$2)*(INDEX(base_indices,,1)<=$E$2),INDEX(base_indices,,),0))/SUM(IF((INDEX(base_indices,1,)=$A21)*(INDEX(base_indices,,1)>=$F$2)*(INDEX(base_indices,,1)<=$G$2),INDEX(base_indices,,),0))-1","v":2.0231213872832443E-2},{"$f":"SUM(IF((INDEX(base_indices,1,)=$A21)*(INDEX(base_indices,,1)>=$D$1)*(INDEX(base_indices,,1)<=$E$1),INDEX(base_indices,,),0))/SUM(IF((INDEX(base_indices,1,)=$A21)*(INDEX(base_indices,,1)>=$F$1)*(INDEX(base_indices,,1)<=$G$1),INDEX(base_indices,,),0))-1","v":5.7553956834532904E-3},null,16,null,"010534654","Tubes, tuyaux, profilés creux et accessoires correspondants en acier","https://www.insee.fr/fr/statistiques/serie/010534654",2.8288130650335308E-2,5.8277541083384232E-2,{"$f":"IF(SUM(IF((INDEX(compo,3,)=I21)*(INDEX(compo,,1)='Evol indices 3-6 mois glissants'!$D$7),INDEX(compo,,),0))>0,\"x\",\"\")","v":""}]
[{"$f":"OFFSET('Indice prix'!$B$2,0,$G22)","v":"010534614"},{"$f":"OFFSET('Indice prix'!$B$5,0,$G22)","v":"Produits explosifs"},{"$f":"OFFSET('Indice prix'!$B$4,0,$G22)","v":"https://www.insee.fr/fr/statistiques/serie/010534614"},{"$f":"SUM(IF((INDEX(base_indices,1,)=$A22)*(INDEX(base_indices,,1)>=$D$2)*(INDEX(base_indices,,1)<=$E$2),INDEX(base_indices,,),0))/SUM(IF((INDEX(base_indices,1,)=$A22)*(INDEX(base_indices,,1)>=$F$2)*(INDEX(base_indices,,1)<=$G$2),INDEX(base_indices,,),0))-1","v":6.3877355477481856E-4},{"$f":"SUM(IF((INDEX(base_indices,1,)=$A22)*(INDEX(base_indices,,1)>=$D$1)*(INDEX(base_indices,,1)<=$E$1),INDEX(base_indices,,),0))/SUM(IF((INDEX(base_indices,1,)=$A22)*(INDEX(base_indices,,1)>=$F$1)*(INDEX(base_indices,,1)<=$G$1),INDEX(base_indices,,),0))-1","v":7.8841512469831621E-3},null,17,null,"010534642","Ciment, chaux et plâtre","https://www.insee.fr/fr/statistiques/serie/010534642",2.0231213872832443E-2,5.7553956834532904E-3,{"$f":"IF(SUM(IF((INDEX(compo,3,)=I22)*(INDEX(compo,,1)='Evol indices 3-6 mois glissants'!$D$7),INDEX(compo,,),0))>0,\"x\",\"\")","v":""}]
[{"$f":"OFFSET('Indice prix'!$B$2,0,$G23)","v":"010536462"},{"$f":"OFFSET('Indice prix'!$B$5,0,$G23)","v":"Acier pour la construction"},{"$f":"OFFSET('Indice prix'!$B$4,0,$G23)","v":"https://www.insee.fr/fr/statistiques/serie/010536462"},{"$f":"SUM(IF((INDEX(base_indices,1,)=$A23)*(INDEX(base_indices,,1)>=$D$2)*(INDEX(base_indices,,1)<=$E$2),INDEX(base_indices,,),0))/SUM(IF((INDEX(base_indices,1,)=$A23)*(INDEX(base_indices,,1)>=$F$2)*(INDEX(base_indices,,1)<=$G$2),INDEX(base_indices,,),0))-1","v":0.17116564417177926},{"$f":"SUM(IF((INDEX(base_indices,1,)=$A23)*(INDEX(base_indices,,1)>=$D$1)*(INDEX(base_indices,,1)<=$E$1),INDEX(base_indices,,),0))/SUM(IF((INDEX(base_indices,1,)=$A23)*(INDEX(base_indices,,1)>=$F$1)*(INDEX(base_indices,,1)<=$G$1),INDEX(base_indices,,),0))-1","v":0.39184583114840055},null,18,null,"001763781","Restaurants et hôtels","https://www.insee.fr/fr/statistiques/serie/001763781",2.0182530932255416E-2,2.5799328191092208E-2,{"$f":"IF(SUM(IF((INDEX(compo,3,)=I23)*(INDEX(compo,,1)='Evol indices 3-6 mois glissants'!$D$7),INDEX(compo,,),0))>0,\"x\",\"\")","v":""}]
[{"$f":"OFFSET('Indice prix'!$B$2,0,$G24)","v":"010534598"},{"$f":"OFFSET('Indice prix'!$B$5,0,$G24)","v":"Bitume"},{"$f":"OFFSET('Indice prix'!$B$4,0,$G24)","v":"https://www.insee.fr/fr/statistiques/serie/010534598"},{"$f":"SUM(IF((INDEX(base_indices,1,)=$A24)*(INDEX(base_indices,,1)>=$D$2)*(INDEX(base_indices,,1)<=$E$2),INDEX(base_indices,,),0))/SUM(IF((INDEX(base_indices,1,)=$A24)*(INDEX(base_indices,,1)>=$F$2)*(INDEX(base_indices,,1)<=$G$2),INDEX(base_indices,,),0))-1","v":9.8974680895584921E-2},{"$f":"SUM(IF((INDEX(base_indices,1,)=$A24)*(INDEX(base_indices,,1)>=$D$1)*(INDEX(base_indices,,1)<=$E$1),INDEX(base_indices,,),0))/SUM(IF((INDEX(base_indices,1,)=$A24)*(INDEX(base_indices,,1)>=$F$1)*(INDEX(base_indices,,1)<=$G$1),INDEX(base_indices,,),0))-1","v":0.18963472485768484},null,19,null,"010534252","Produits de voierie en béton","https://www.insee.fr/fr/statistiques/serie/010534252",2.0036991368680646E-2,1.8337218337218353E-2,{"$f":"IF(SUM(IF((INDEX(compo,3,)=I24)*(INDEX(compo,,1)='Evol indices 3-6 mois glissants'!$D$7),INDEX(compo,,),0))>0,\"x\",\"\")","v":""}]
[{"$f":"OFFSET('Indice prix'!$B$2,0,$G25)","v":"010534252"},{"$f":"OFFSET('Indice prix'!$B$5,0,$G25)","v":"Produits de voierie en béton"},{"$f":"OFFSET('Indice prix'!$B$4,0,$G25)","v":"https://www.insee.fr/fr/statistiques/serie/010534252"},{"$f":"SUM(IF((INDEX(base_indices,1,)=$A25)*(INDEX(base_indices,,1)>=$D$2)*(INDEX(base_indices,,1)<=$E$2),INDEX(base_indices,,),0))/SUM(IF((INDEX(base_indices,1,)=$A25)*(INDEX(base_indices,,1)>=$F$2)*(INDEX(base_indices,,1)<=$G$2),INDEX(base_indices,,),0))-1","v":2.0036991368680646E-2},{"$f":"SUM(IF((INDEX(base_indices,1,)=$A25)*(INDEX(base_indices,,1)>=$D$1)*(INDEX(base_indices,,1)<=$E$1),INDEX(base_indices,,),0))/SUM(IF((INDEX(base_indices,1,)=$A25)*(INDEX(base_indices,,1)>=$F$1)*(INDEX(base_indices,,1)<=$G$1),INDEX(base_indices,,),0))-1","v":1.8337218337218353E-2},null,20,null,"010534253","Tuyaux d'assainissement","https://www.insee.fr/fr/statistiques/serie/010534253",1.4519056261342866E-2,6.2031573911656812E-2,{"$f":"IF(SUM(IF((INDEX(compo,3,)=I25)*(INDEX(compo,,1)='Evol indices 3-6 mois glissants'!$D$7),INDEX(compo,,),0))>0,\"x\",\"\")","v":""}]
[{"$f":"OFFSET('Indice prix'!$B$2,0,$G26)","v":"010534647"},{"$f":"OFFSET('Indice prix'!$B$5,0,$G26)","v":"Mortiers et bétons secs"},{"$f":"OFFSET('Indice prix'!$B$4,0,$G26)","v":"https://www.insee.fr/fr/statistiques/serie/010534647"},{"$f":"SUM(IF((INDEX(base_indices,1,)=$A26)*(INDEX(base_indices,,1)>=$D$2)*(INDEX(base_indices,,1)<=$E$2),INDEX(base_indices,,),0))/SUM(IF((INDEX(base_indices,1,)=$A26)*(INDEX(base_indices,,1)>=$F$2)*(INDEX(base_indices,,1)<=$G$2),INDEX(base_indices,,),0))-1","v":1.051939513477973E-2},{"$f":"SUM(IF((INDEX(base_indices,1,)=$A26)*(INDEX(base_indices,,1)>=$D$1)*(INDEX(base_indices,,1)<=$E$1),INDEX(base_indices,,),0))/SUM(IF((INDEX(base_indices,1,)=$A26)*(INDEX(base_indices,,1)>=$F$1)*(INDEX(base_indices,,1)<=$G$1),INDEX(base_indices,,),0))-1","v":1.6622340425531901E-2},null,21,null,"010534696","Moteurs, génératrices, transfo. électr., matér. distrib., cmde électr.","https://www.insee.fr/fr/statistiques/serie/010534696",1.4294790343075015E-2,1.2615777706803E-2,{"$f":"IF(SUM(IF((INDEX(compo,3,)=I26)*(INDEX(compo,,1)='Evol indices 3-6 mois glissants'!$D$7),INDEX(compo,,),0))>0,\"x\",\"\")","v":""}]
[{"$f":"OFFSET('Indice prix'!$B$2,0,$G27)","v":"010534662"},{"$f":"OFFSET('Indice prix'!$B$5,0,$G27)","v":"Travaux de fonderie de fonte"},{"$f":"OFFSET('Indice prix'!$B$4,0,$G27)","v":"https://www.insee.fr/fr/statistiques/serie/010534662"},{"$f":"SUM(IF((INDEX(base_indices,1,)=$A27)*(INDEX(base_indices,,1)>=$D$2)*(INDEX(base_indices,,1)<=$E$2),INDEX(base_indices,,),0))/SUM(IF((INDEX(base_indices,1,)=$A27)*(INDEX(base_indices,,1)>=$F$2)*(INDEX(base_indices,,1)<=$G$2),INDEX(base_indices,,),0))-1","v":4.1233657391887446E-2},{"$f":"SUM(IF((INDEX(base_indices,1,)=$A27)*(INDEX(base_indices,,1)>=$D$1)*(INDEX(base_indices,,1)<=$E$1),INDEX(base_indices,,),0))/SUM(IF((INDEX(base_indices,1,)=$A27)*(INDEX(base_indices,,1)>=$F$1)*(INDEX(base_indices,,1)<=$G$1),INDEX(base_indices,,),0))-1","v":7.0311126735805862E-2},null,22,null,"010534698","Matériel de distribution et de commande électrique","https://www.insee.fr/fr/statistiques/serie/010534698",1.2614317250078777E-2,1.4303877940241572E-2,{"$f":"IF(SUM(IF((INDEX(compo,3,)=I27)*(INDEX(compo,,1)='Evol indices 3-6 mois glissants'!$D$7),INDEX(compo,,),0))>0,\"x\",\"\")","v":""}]
[{"$f":"OFFSET('Indice prix'!$B$2,0,$G28)","v":"010534638"},{"$f":"OFFSET('Indice prix'!$B$5,0,$G28)","v":"Tuiles, briques et produits de construction en terre cuite"},{"$f":"OFFSET('Indice prix'!$B$4,0,$G28)","v":"https://www.insee.fr/fr/statistiques/serie/010534638"},{"$f":"SUM(IF((INDEX(base_indices,1,)=$A28)*(INDEX(base_indices,,1)>=$D$2)*(INDEX(base_indices,,1)<=$E$2),INDEX(base_indices,,),0))/SUM(IF((INDEX(base_indices,1,)=$A28)*(INDEX(base_indices,,1)>=$F$2)*(INDEX(base_indices,,1)<=$G$2),INDEX(base_indices,,),0))-1","v":7.6433121019108263E-3},{"$f":"SUM(IF((INDEX(base_indices,1,)=$A28)*(INDEX(base_indices,,1)>=$D$1)*(INDEX(base_indices,,1)<=$E$1),INDEX(base_indices,,),0))/SUM(IF((INDEX(base_indices,1,)=$A28)*(INDEX(base_indices,,1)>=$F$1)*(INDEX(base_indices,,1)<=$G$1),INDEX(base_indices,,),0))-1","v":2.2049286640726473E-2},null,23,null,"010534647","Mortiers et bétons secs","https://www.insee.fr/fr/statistiques/serie/010534647",1.051939513477973E-2,1.6622340425531901E-2,{"$f":"IF(SUM(IF((INDEX(compo,3,)=I28)*(INDEX(compo,,1)='Evol indices 3-6 mois glissants'!$D$7),INDEX(compo,,),0))>0,\"x\",\"\")","v":""}]
[{"$f":"OFFSET('Indice prix'!$B$2,0,$G29)","v":"010534253"},{"$f":"OFFSET('Indice prix'!$B$5,0,$G29)","v":"Tuyaux d'assainissement"},{"$f":"OFFSET('Indice prix'!$B$4,0,$G29)","v":"https://www.insee.fr/fr/statistiques/serie/010534253"},{"$f":"SUM(IF((INDEX(base_indices,1,)=$A29)*(INDEX(base_indices,,1)>=$D$2)*(INDEX(base_indices,,1)<=$E$2),INDEX(base_indices,,),0))/SUM(IF((INDEX(base_indices,1,)=$A29)*(INDEX(base_indices,,1)>=$F$2)*(INDEX(base_indices,,1)<=$G$2),INDEX(base_indices,,),0))-1","v":1.4519056261342866E-2},{"$f":"SUM(IF((INDEX(base_indices,1,)=$A29)*(INDEX(base_indices,,1)>=$D$1)*(INDEX(base_indices,,1)<=$E$1),INDEX(base_indices,,),0))/SUM(IF((INDEX(base_indices,1,)=$A29)*(INDEX(base_indices,,1)>=$F$1)*(INDEX(base_indices,,1)<=$G$1),INDEX(base_indices,,),0))-1","v":6.2031573911656812E-2},null,24,null,"001711009","Matériel","https://www.insee.fr/fr/statistiques/serie/001711009",7.7327559542221813E-3,2.5110549589387299E-2,{"$f":"IF(SUM(IF((INDEX(compo,3,)=I29)*(INDEX(compo,,1)='Evol indices 3-6 mois glissants'!$D$7),INDEX(compo,,),0))>0,\"x\",\"\")","v":"x"}]
[{"$f":"OFFSET('Indice prix'!$B$2,0,$G30)","v":"010534559"},{"$f":"OFFSET('Indice prix'!$B$5,0,$G30)","v":"Autres textiles n.c.a."},{"$f":"OFFSET('Indice prix'!$B$4,0,$G30)","v":"https://www.insee.fr/fr/statistiques/serie/010534559"},{"$f":"SUM(IF((INDEX(base_indices,1,)=$A30)*(INDEX(base_indices,,1)>=$D$2)*(INDEX(base_indices,,1)<=$E$2),INDEX(base_indices,,),0))/SUM(IF((INDEX(base_indices,1,)=$A30)*(INDEX(base_indices,,1)>=$F$2)*(INDEX(base_indices,,1)<=$G$2),INDEX(base_indices,,),0))-1","v":6.7922198209322548E-3},{"$f":"SUM(IF((INDEX(base_indices,1,)=$A30)*(INDEX(base_indices,,1)>=$D$1)*(INDEX(base_indices,,1)<=$E$1),INDEX(base_indices,,),0))/SUM(IF((INDEX(base_indices,1,)=$A30)*(INDEX(base_indices,,1)>=$F$1)*(INDEX(base_indices,,1)<=$G$1),INDEX(base_indices,,),0))-1","v":3.0864197530864335E-3},null,25,null,"010534638","Tuiles, briques et produits de construction en terre cuite","https://www.insee.fr/fr/statistiques/serie/010534638",7.6433121019108263E-3,2.2049286640726473E-2,{"$f":"IF(SUM(IF((INDEX(compo,3,)=I30)*(INDEX(compo,,1)='Evol indices 3-6 mois glissants'!$D$7),INDEX(compo,,),0))>0,\"x\",\"\")","v":""}]
[{"$f":"OFFSET('Indice prix'!$B$2,0,$G31)","v":"010534606"},{"$f":"OFFSET('Indice prix'!$B$5,0,$G31)","v":"Matières plastiques sous formes primaires"},{"$f":"OFFSET('Indice prix'!$B$4,0,$G31)","v":"https://www.insee.fr/fr/statistiques/serie/010534606"},{"$f":"SUM(IF((INDEX(base_indices,1,)=$A31)*(INDEX(base_indices,,1)>=$D$2)*(INDEX(base_indices,,1)<=$E$2),INDEX(base_indices,,),0))/SUM(IF((INDEX(base_indices,1,)=$A31)*(INDEX(base_indices,,1)>=$F$2)*(INDEX(base_indices,,1)<=$G$2),INDEX(base_indices,,),0))-1","v":-1.6895969104513409E-3},{"$f":"SUM(IF((INDEX(base_indices,1,)=$A31)*(INDEX(base_indices,,1)>=$D$1)*(INDEX(base_indices,,1)<=$E$1),INDEX(base_indices,,),0))/SUM(IF((INDEX(base_indices,1,)=$A31)*(INDEX(base_indices,,1)>=$F$1)*(INDEX(base_indices,,1)<=$G$1),INDEX(base_indices,,),0))-1","v":0.26532171786642222},null,26,null,"010534645","Éléments en béton pour la construction","https://www.insee.fr/fr/statistiques/serie/010534645",7.6238881829733263E-3,1.5097976228718224E-2,{"$f":"IF(SUM(IF((INDEX(compo,3,)=I31)*(INDEX(compo,,1)='Evol indices 3-6 mois glissants'!$D$7),INDEX(compo,,),0))>0,\"x\",\"\")","v":""}]
[{"$f":"OFFSET('Indice prix'!$B$2,0,$G32)","v":"010534654"},{"$f":"OFFSET('Indice prix'!$B$5,0,$G32)","v":"Tubes, tuyaux, profilés creux et accessoires correspondants en acier"},{"$f":"OFFSET('Indice prix'!$B$4,0,$G32)","v":"https://www.insee.fr/fr/statistiques/serie/010534654"},{"$f":"SUM(IF((INDEX(base_indices,1,)=$A32)*(INDEX(base_indices,,1)>=$D$2)*(INDEX(base_indices,,1)<=$E$2),INDEX(base_indices,,),0))/SUM(IF((INDEX(base_indices,1,)=$A32)*(INDEX(base_indices,,1)>=$F$2)*(INDEX(base_indices,,1)<=$G$2),INDEX(base_indices,,),0))-1","v":2.8288130650335308E-2},{"$f":"SUM(IF((INDEX(base_indices,1,)=$A32)*(INDEX(base_indices,,1)>=$D$1)*(INDEX(base_indices,,1)<=$E$1),INDEX(base_indices,,),0))/SUM(IF((INDEX(base_indices,1,)=$A32)*(INDEX(base_indices,,1)>=$F$1)*(INDEX(base_indices,,1)<=$G$1),INDEX(base_indices,,),0))-1","v":5.8277541083384232E-2},null,27,null,"010534559","Autres textiles n.c.a.","https://www.insee.fr/fr/statistiques/serie/010534559",6.7922198209322548E-3,3.0864197530864335E-3,{"$f":"IF(SUM(IF((INDEX(compo,3,)=I32)*(INDEX(compo,,1)='Evol indices 3-6 mois glissants'!$D$7),INDEX(compo,,),0))>0,\"x\",\"\")","v":""}]
[{"$f":"OFFSET('Indice prix'!$B$2,0,$G33)","v":"010534645"},{"$f":"OFFSET('Indice prix'!$B$5,0,$G33)","v":"Éléments en béton pour la construction"},{"$f":"OFFSET('Indice prix'!$B$4,0,$G33)","v":"https://www.insee.fr/fr/statistiques/serie/010534645"},{"$f":"SUM(IF((INDEX(base_indices,1,)=$A33)*(INDEX(base_indices,,1)>=$D$2)*(INDEX(base_indices,,1)<=$E$2),INDEX(base_indices,,),0))/SUM(IF((INDEX(base_indices,1,)=$A33)*(INDEX(base_indices,,1)>=$F$2)*(INDEX(base_indices,,1)<=$G$2),INDEX(base_indices,,),0))-1","v":7.6238881829733263E-3},{"$f":"SUM(IF((INDEX(base_indices,1,)=$A33)*(INDEX(base_indices,,1)>=$D$1)*(INDEX(base_indices,,1)<=$E$1),INDEX(base_indices,,),0))/SUM(IF((INDEX(base_indices,1,)=$A33)*(INDEX(base_indices,,1)>=$F$1)*(INDEX(base_indices,,1)<=$G$1),INDEX(base_indices,,),0))-1","v":1.5097976228718224E-2},null,28,null,"001711011","Frais divers","https://www.insee.fr/fr/statistiques/serie/001711011",6.0126582278481333E-3,2.2254475084663605E-2,{"$f":"IF(SUM(IF((INDEX(compo,3,)=I33)*(INDEX(compo,,1)='Evol indices 3-6 mois glissants'!$D$7),INDEX(compo,,),0))>0,\"x\",\"\")","v":"x"}]
[{"$f":"OFFSET('Indice prix'!$B$2,0,$G34)","v":"010534330"},{"$f":"OFFSET('Indice prix'!$B$5,0,$G34)","v":"Fils et câbles d'énergie"},{"$f":"OFFSET('Indice prix'!$B$4,0,$G34)","v":"https://www.insee.fr/fr/statistiques/serie/010534330"},{"$f":"SUM(IF((INDEX(base_indices,1,)=$A34)*(INDEX(base_indices,,1)>=$D$2)*(INDEX(base_indices,,1)<=$E$2),INDEX(base_indices,,),0))/SUM(IF((INDEX(base_indices,1,)=$A34)*(INDEX(base_indices,,1)>=$F$2)*(INDEX(base_indices,,1)<=$G$2),INDEX(base_indices,,),0))-1","v":6.4367816091953856E-2},{"$f":"SUM(IF((INDEX(base_indices,1,)=$A34)*(INDEX(base_indices,,1)>=$D$1)*(INDEX(base_indices,,1)<=$E$1),INDEX(base_indices,,),0))/SUM(IF((INDEX(base_indices,1,)=$A34)*(INDEX(base_indices,,1)>=$F$1)*(INDEX(base_indices,,1)<=$G$1),INDEX(base_indices,,),0))-1","v":0.18411076314488195},null,29,null,"010534646","Béton prêt à l'emploi","https://www.insee.fr/fr/statistiques/serie/010534646",5.969211435752575E-3,6.4627994955861467E-3,{"$f":"IF(SUM(IF((INDEX(compo,3,)=I34)*(INDEX(compo,,1)='Evol indices 3-6 mois glissants'!$D$7),INDEX(compo,,),0))>0,\"x\",\"\")","v":"x"}]
[{"$f":"OFFSET('Indice prix'!$B$2,0,$G35)","v":"010534696"},{"$f":"OFFSET('Indice prix'!$B$5,0,$G35)","v":"Moteurs, génératrices, transfo. électr., matér. distrib., cmde électr."},{"$f":"OFFSET('Indice prix'!$B$4,0,$G35)","v":"https://www.insee.fr/fr/statistiques/serie/010534696"},{"$f":"SUM(IF((INDEX(base_indices,1,)=$A35)*(INDEX(base_indices,,1)>=$D$2)*(INDEX(base_indices,,1)<=$E$2),INDEX(base_indices,,),0))/SUM(IF((INDEX(base_indices,1,)=$A35)*(INDEX(base_indices,,1)>=$F$2)*(INDEX(base_indices,,1)<=$G$2),INDEX(base_indices,,),0))-1","v":1.4294790343075015E-2},{"$f":"SUM(IF((INDEX(base_indices,1,)=$A35)*(INDEX(base_indices,,1)>=$D$1)*(INDEX(base_indices,,1)<=$E$1),INDEX(base_indices,,),0))/SUM(IF((INDEX(base_indices,1,)=$A35)*(INDEX(base_indices,,1)>=$F$1)*(INDEX(base_indices,,1)<=$G$1),INDEX(base_indices,,),0))-1","v":1.2615777706803E-2},null,30,null,"001711943","Transports routiers","https://www.insee.fr/fr/statistiques/serie/001711943",2.721499848805653E-3,1.2381534698868712E-2,{"$f":"IF(SUM(IF((INDEX(compo,3,)=I35)*(INDEX(compo,,1)='Evol indices 3-6 mois glissants'!$D$7),INDEX(compo,,),0))>0,\"x\",\"\")","v":"x"}]
[{"$f":"OFFSET('Indice prix'!$B$2,0,$G36)","v":"010534698"},{"$f":"OFFSET('Indice prix'!$B$5,0,$G36)","v":"Matériel de distribution et de commande électrique"},{"$f":"OFFSET('Indice prix'!$B$4,0,$G36)","v":"https://www.insee.fr/fr/statistiques/serie/010534698"},{"$f":"SUM(IF((INDEX(base_indices,1,)=$A36)*(INDEX(base_indices,,1)>=$D$2)*(INDEX(base_indices,,1)<=$E$2),INDEX(base_indices,,),0))/SUM(IF((INDEX(base_indices,1,)=$A36)*(INDEX(base_indices,,1)>=$F$2)*(INDEX(base_indices,,1)<=$G$2),INDEX(base_indices,,),0))-1","v":1.2614317250078777E-2},{"$f":"SUM(IF((INDEX(base_indices,1,)=$A36)*(INDEX(base_indices,,1)>=$D$1)*(INDEX(base_indices,,1)<=$E$1),INDEX(base_indices,,),0))/SUM(IF((INDEX(base_indices,1,)=$A36)*(INDEX(base_indices,,1)>=$F$1)*(INDEX(base_indices,,1)<=$G$1),INDEX(base_indices,,),0))-1","v":1.4303877940241572E-2},null,31,null,"010534789","Traitement et élimination des déchets non dangereux","https://www.insee.fr/fr/statistiques/serie/010534789",1.9768426998023614E-3,2.5756041093908388E-2,{"$f":"IF(SUM(IF((INDEX(compo,3,)=I36)*(INDEX(compo,,1)='Evol indices 3-6 mois glissants'!$D$7),INDEX(compo,,),0))>0,\"x\",\"\")","v":""}]
[{"$f":"OFFSET('Indice prix'!$B$2,0,$G37)","v":"010534702"},{"$f":"OFFSET('Indice prix'!$B$5,0,$G37)","v":"Appareils d'éclairage électrique"},{"$f":"OFFSET('Indice prix'!$B$4,0,$G37)","v":"https://www.insee.fr/fr/statistiques/serie/010534702"},{"$f":"SUM(IF((INDEX(base_indices,1,)=$A37)*(INDEX(base_indices,,1)>=$D$2)*(INDEX(base_indices,,1)<=$E$2),INDEX(base_indices,,),0))/SUM(IF((INDEX(base_indices,1,)=$A37)*(INDEX(base_indices,,1)>=$F$2)*(INDEX(base_indices,,1)<=$G$2),INDEX(base_indices,,),0))-1","v":-9.6054888507719483E-3},{"$f":"SUM(IF((INDEX(base_indices,1,)=$A37)*(INDEX(base_indices,,1)>=$D$1)*(INDEX(base_indices,,1)<=$E$1),INDEX(base_indices,,),0))/SUM(IF((INDEX(base_indices,1,)=$A37)*(INDEX(base_indices,,1)>=$F$1)*(INDEX(base_indices,,1)<=$G$1),INDEX(base_indices,,),0))-1","v":-1.2425531914893595E-2},null,32,null,"010536067","Sables et granulats","https://www.insee.fr/fr/statistiques/serie/010536067",1.9212295869357465E-3,5.3063193439459866E-3,{"$f":"IF(SUM(IF((INDEX(compo,3,)=I37)*(INDEX(compo,,1)='Evol indices 3-6 mois glissants'!$D$7),INDEX(compo,,),0))>0,\"x\",\"\")","v":""}]
[{"$f":"OFFSET('Indice prix'!$B$2,0,$G38)","v":"010535345"},{"$f":"OFFSET('Indice prix'!$B$5,0,$G38)","v":"Câbles de fibres optiques"},{"$f":"OFFSET('Indice prix'!$B$4,0,$G38)","v":"https://www.insee.fr/fr/statistiques/serie/010535345"},{"$f":"SUM(IF((INDEX(base_indices,1,)=$A38)*(INDEX(base_indices,,1)>=$D$2)*(INDEX(base_indices,,1)<=$E$2),INDEX(base_indices,,),0))/SUM(IF((INDEX(base_indices,1,)=$A38)*(INDEX(base_indices,,1)>=$F$2)*(INDEX(base_indices,,1)<=$G$2),INDEX(base_indices,,),0))-1","v":-9.752925877763996E-4},{"$f":"SUM(IF((INDEX(base_indices,1,)=$A38)*(INDEX(base_indices,,1)>=$D$1)*(INDEX(base_indices,,1)<=$E$1),INDEX(base_indices,,),0))/SUM(IF((INDEX(base_indices,1,)=$A38)*(INDEX(base_indices,,1)>=$F$1)*(INDEX(base_indices,,1)<=$G$1),INDEX(base_indices,,),0))-1","v":-2.7979766044893939E-2},null,33,null,"5540998","Travail","https://www.insee.fr/fr/statistiques/6020697",8.1588251291808689E-4,-5.6764427625354275E-3,{"$f":"IF(SUM(IF((INDEX(compo,3,)=I38)*(INDEX(compo,,1)='Evol indices 3-6 mois glissants'!$D$7),INDEX(compo,,),0))>0,\"x\",\"\")","v":"x"}]
[{"$f":"OFFSET('Indice prix'!$B$2,0,$G39)","v":"010534180"},{"$f":"OFFSET('Indice prix'!$B$5,0,$G39)","v":"Peintures Industries"},{"$f":"OFFSET('Indice prix'!$B$4,0,$G39)","v":"https://www.insee.fr/fr/statistiques/serie/010534180"},{"$f":"SUM(IF((INDEX(base_indices,1,)=$A39)*(INDEX(base_indices,,1)>=$D$2)*(INDEX(base_indices,,1)<=$E$2),INDEX(base_indices,,),0))/SUM(IF((INDEX(base_indices,1,)=$A39)*(INDEX(base_indices,,1)>=$F$2)*(INDEX(base_indices,,1)<=$G$2),INDEX(base_indices,,),0))-1","v":6.4068497195157947E-2},{"$f":"SUM(IF((INDEX(base_indices,1,)=$A39)*(INDEX(base_indices,,1)>=$D$1)*(INDEX(base_indices,,1)<=$E$1),INDEX(base_indices,,),0))/SUM(IF((INDEX(base_indices,1,)=$A39)*(INDEX(base_indices,,1)>=$F$1)*(INDEX(base_indices,,1)<=$G$1),INDEX(base_indices,,),0))-1","v":5.9402939839369617E-2},null,34,null,"010534614","Produits explosifs","https://www.insee.fr/fr/statistiques/serie/010534614",6.3877355477481856E-4,7.8841512469831621E-3,{"$f":"IF(SUM(IF((INDEX(compo,3,)=I39)*(INDEX(compo,,1)='Evol indices 3-6 mois glissants'!$D$7),INDEX(compo,,),0))>0,\"x\",\"\")","v":""}]
[{"$f":"OFFSET('Indice prix'!$B$2,0,$G40)","v":"010534267"},{"$f":"OFFSET('Indice prix'!$B$5,0,$G40)","v":"Produits sidérurgiques en acier non allié"},{"$f":"OFFSET('Indice prix'!$B$4,0,$G40)","v":"https://www.insee.fr/fr/statistiques/serie/010534267"},{"$f":"SUM(IF((INDEX(base_indices,1,)=$A40)*(INDEX(base_indices,,1)>=$D$2)*(INDEX(base_indices,,1)<=$E$2),INDEX(base_indices,,),0))/SUM(IF((INDEX(base_indices,1,)=$A40)*(INDEX(base_indices,,1)>=$F$2)*(INDEX(base_indices,,1)<=$G$2),INDEX(base_indices,,),0))-1","v":9.6252755326965422E-2},{"$f":"SUM(IF((INDEX(base_indices,1,)=$A40)*(INDEX(base_indices,,1)>=$D$1)*(INDEX(base_indices,,1)<=$E$1),INDEX(base_indices,,),0))/SUM(IF((INDEX(base_indices,1,)=$A40)*(INDEX(base_indices,,1)>=$F$1)*(INDEX(base_indices,,1)<=$G$1),INDEX(base_indices,,),0))-1","v":0.22149279292136415},null,35,null,"001565195","Travail activités spécialisées","https://www.insee.fr/fr/statistiques/serie/001565195",-2.7070925825667391E-4,-3.6417588346372431E-3,{"$f":"IF(SUM(IF((INDEX(compo,3,)=I40)*(INDEX(compo,,1)='Evol indices 3-6 mois glissants'!$D$7),INDEX(compo,,),0))>0,\"x\",\"\")","v":""}]
[{"$f":"OFFSET('Indice prix'!$B$2,0,$G41)","v":"010536480"},{"$f":"OFFSET('Indice prix'!$B$5,0,$G41)","v":"Tôles quarto et autres produits plats en aciers non alliés de qualité"},{"$f":"OFFSET('Indice prix'!$B$4,0,$G41)","v":"https://www.insee.fr/fr/statistiques/serie/010536480"},{"$f":"SUM(IF((INDEX(base_indices,1,)=$A41)*(INDEX(base_indices,,1)>=$D$2)*(INDEX(base_indices,,1)<=$E$2),INDEX(base_indices,,),0))/SUM(IF((INDEX(base_indices,1,)=$A41)*(INDEX(base_indices,,1)>=$F$2)*(INDEX(base_indices,,1)<=$G$2),INDEX(base_indices,,),0))-1","v":0.19175349146530674},{"$f":"SUM(IF((INDEX(base_indices,1,)=$A41)*(INDEX(base_indices,,1)>=$D$1)*(INDEX(base_indices,,1)<=$E$1),INDEX(base_indices,,),0))/SUM(IF((INDEX(base_indices,1,)=$A41)*(INDEX(base_indices,,1)>=$F$1)*(INDEX(base_indices,,1)<=$G$1),INDEX(base_indices,,),0))-1","v":0.4941816533172132},null,36,null,"010535345","Câbles de fibres optiques","https://www.insee.fr/fr/statistiques/serie/010535345",-9.752925877763996E-4,-2.7979766044893939E-2,{"$f":"IF(SUM(IF((INDEX(compo,3,)=I41)*(INDEX(compo,,1)='Evol indices 3-6 mois glissants'!$D$7),INDEX(compo,,),0))>0,\"x\",\"\")","v":""}]
[{"$f":"OFFSET('Indice prix'!$B$2,0,$G42)","v":"010534667"},{"$f":"OFFSET('Indice prix'!$B$5,0,$G42)","v":"Éléments en métal pour la construction"},{"$f":"OFFSET('Indice prix'!$B$4,0,$G42)","v":"https://www.insee.fr/fr/statistiques/serie/010534667"},{"$f":"SUM(IF((INDEX(base_indices,1,)=$A42)*(INDEX(base_indices,,1)>=$D$2)*(INDEX(base_indices,,1)<=$E$2),INDEX(base_indices,,),0))/SUM(IF((INDEX(base_indices,1,)=$A42)*(INDEX(base_indices,,1)>=$F$2)*(INDEX(base_indices,,1)<=$G$2),INDEX(base_indices,,),0))-1","v":4.878752886836013E-2},{"$f":"SUM(IF((INDEX(base_indices,1,)=$A42)*(INDEX(base_indices,,1)>=$D$1)*(INDEX(base_indices,,1)<=$E$1),INDEX(base_indices,,),0))/SUM(IF((INDEX(base_indices,1,)=$A42)*(INDEX(base_indices,,1)>=$F$1)*(INDEX(base_indices,,1)<=$G$1),INDEX(base_indices,,),0))-1","v":6.7860367138128153E-2},null,37,null,"010534606","Matières plastiques sous formes primaires","https://www.insee.fr/fr/statistiques/serie/010534606",-1.6895969104513409E-3,0.26532171786642222,{"$f":"IF(SUM(IF((INDEX(compo,3,)=I42)*(INDEX(compo,,1)='Evol indices 3-6 mois glissants'!$D$7),INDEX(compo,,),0))>0,\"x\",\"\")","v":""}]
[{"$f":"OFFSET('Indice prix'!$B$2,0,$G43)","v":"001763781"},{"$f":"OFFSET('Indice prix'!$B$5,0,$G43)","v":"Restaurants et hôtels"},{"$f":"OFFSET('Indice prix'!$B$4,0,$G43)","v":"https://www.insee.fr/fr/statistiques/serie/001763781"},{"$f":"SUM(IF((INDEX(base_indices,1,)=$A43)*(INDEX(base_indices,,1)>=$D$2)*(INDEX(base_indices,,1)<=$E$2),INDEX(base_indices,,),0))/SUM(IF((INDEX(base_indices,1,)=$A43)*(INDEX(base_indices,,1)>=$F$2)*(INDEX(base_indices,,1)<=$G$2),INDEX(base_indices,,),0))-1","v":2.0182530932255416E-2},{"$f":"SUM(IF((INDEX(base_indices,1,)=$A43)*(INDEX(base_indices,,1)>=$D$1)*(INDEX(base_indices,,1)<=$E$1),INDEX(base_indices,,),0))/SUM(IF((INDEX(base_indices,1,)=$A43)*(INDEX(base_indices,,1)>=$F$1)*(INDEX(base_indices,,1)<=$G$1),INDEX(base_indices,,),0))-1","v":2.5799328191092208E-2},null,38,null,"010534784","Collecte, traitement et élimination des déchets ; récupération de matériaux","https://www.insee.fr/fr/statistiques/serie/010534784",-5.7581573896352545E-3,9.9803417510963E-2,{"$f":"IF(SUM(IF((INDEX(compo,3,)=I43)*(INDEX(compo,,1)='Evol indices 3-6 mois glissants'!$D$7),INDEX(compo,,),0))>0,\"x\",\"\")","v":""}]
[{"$f":"OFFSET('Indice prix'!$B$2,0,$G44)","v":"010534789"},{"$f":"OFFSET('Indice prix'!$B$5,0,$G44)","v":"Traitement et élimination des déchets non dangereux"},{"$f":"OFFSET('Indice prix'!$B$4,0,$G44)","v":"https://www.insee.fr/fr/statistiques/serie/010534789"},{"$f":"SUM(IF((INDEX(base_indices,1,)=$A44)*(INDEX(base_indices,,1)>=$D$2)*(INDEX(base_indices,,1)<=$E$2),INDEX(base_indices,,),0))/SUM(IF((INDEX(base_indices,1,)=$A44)*(INDEX(base_indices,,1)>=$F$2)*(INDEX(base_indices,,1)<=$G$2),INDEX(base_indices,,),0))-1","v":1.9768426998023614E-3},{"$f":"SUM(IF((INDEX(base_indices,1,)=$A44)*(INDEX(base_indices,,1)>=$D$1)*(INDEX(base_indices,,1)<=$E$1),INDEX(base_indices,,),0))/SUM(IF((INDEX(base_indices,1,)=$A44)*(INDEX(base_indices,,1)>=$F$1)*(INDEX(base_indices,,1)<=$G$1),INDEX(base_indices,,),0))-1","v":2.5756041093908388E-2},null,39,null,"010534702","Appareils d'éclairage électrique","https://www.insee.fr/fr/statistiques/serie/010534702",-9.6054888507719483E-3,-1.2425531914893595E-2,{"$f":"IF(SUM(IF((INDEX(compo,3,)=I44)*(INDEX(compo,,1)='Evol indices 3-6 mois glissants'!$D$7),INDEX(compo,,),0))>0,\"x\",\"\")","v":""}]
[{"$f":"OFFSET('Indice prix'!$B$2,0,$G45)","v":"010534784"},{"$f":"OFFSET('Indice prix'!$B$5,0,$G45)","v":"Collecte, traitement et élimination des déchets ; récupération de matériaux"},{"$f":"OFFSET('Indice prix'!$B$4,0,$G45)","v":"https://www.insee.fr/fr/statistiques/serie/010534784"},{"$f":"SUM(IF((INDEX(base_indices,1,)=$A45)*(INDEX(base_indices,,1)>=$D$2)*(INDEX(base_indices,,1)<=$E$2),INDEX(base_indices,,),0))/SUM(IF((INDEX(base_indices,1,)=$A45)*(INDEX(base_indices,,1)>=$F$2)*(INDEX(base_indices,,1)<=$G$2),INDEX(base_indices,,),0))-1","v":-5.7581573896352545E-3},{"$f":"SUM(IF((INDEX(base_indices,1,)=$A45)*(INDEX(base_indices,,1)>=$D$1)*(INDEX(base_indices,,1)<=$E$1),INDEX(base_indices,,),0))/SUM(IF((INDEX(base_indices,1,)=$A45)*(INDEX(base_indices,,1)>=$F$1)*(INDEX(base_indices,,1)<=$G$1),INDEX(base_indices,,),0))-1","v":9.9803417510963E-2},null,40,null,"010534769","Électricité vendue aux entreprises consommatrices finales","https://www.insee.fr/fr/statistiques/serie/010534769",-2.1034180543383019E-2,-0.13398107900792633,{"$f":"IF(SUM(IF((INDEX(compo,3,)=I45)*(INDEX(compo,,1)='Evol indices 3-6 mois glissants'!$D$7),INDEX(compo,,),0))>0,\"x\",\"\")","v":"x"}]

{"sheet":"Index depuis janvier","index":8,"n_rows":30,"n_cols":11,"rows_kept":30,"cut":false,"hidden":true,"merged":[]}
[null,null,"2021-01-01",{"$f":"DATE(2021,MONTH(date),1)","v":"2021-10-01"},"2019-01-01",{"$f":"DATE(2019,MONTH(date),1)","v":"2019-10-01"}]
[null,null,"2021-01-01",{"$f":"DATE(2021,MONTH(date),1)","v":"2021-10-01"},"2020-01-01",{"$f":"DATE(2020,MONTH(date),1)","v":"2020-10-01"}]
[]
[null,null,"/ 2020","/ 2019"]
["TP01",{"$f":"VLOOKUP(A5,'Noms index'!$A$1:$B$23,2,FALSE)","v":"Index général tous travaux"},{"$f":"SUM(IF((INDEX(base_index,1,)=$A5)*(INDEX(base_index,,1)>='Index depuis janvier'!$C$2)*(INDEX(base_index,,1)<='Index depuis janvier'!$D$2),INDEX(base_index,,),0))/SUM(IF((INDEX(base_index,1,)=$A5)*(INDEX(base_index,,1)>='Index depuis janvier'!$E$2)*(INDEX(base_index,,1)<='Index depuis janvier'!$F$2),INDEX(base_index,,),0))-1","v":4.137115839243477E-2},{"$f":"SUM(IF((INDEX(base_index,1,)=$A5)*(INDEX(base_index,,1)>='Index depuis janvier'!$C$1)*(INDEX(base_index,,1)<='Index depuis janvier'!$D$1),INDEX(base_index,,),0))/SUM(IF((INDEX(base_index,1,)=$A5)*(INDEX(base_index,,1)>='Index depuis janvier'!$E$1)*(INDEX(base_index,,1)<='Index depuis janvier'!$F$1),INDEX(base_index,,),0))-1","v":3.0316660669305495E-2},"https://www.insee.fr/fr/statistiques/serie/001711007"]
["TP02",{"$f":"VLOOKUP(A6,'Noms index'!$A$1:$B$23,2,FALSE)","v":"Travaux de génie civil et d’ouvrages d’art neufs ou rénovation"},{"$f":"SUM(IF((INDEX(base_index,1,)=$A6)*(INDEX(base_index,,1)>='Index depuis janvier'!$C$2)*(INDEX(base_index,,1)<='Index depuis janvier'!$D$2),INDEX(base_index,,),0))/SUM(IF((INDEX(base_index,1,)=$A6)*(INDEX(base_index,,1)>='Index depuis janvier'!$E$2)*(INDEX(base_index,,1)<='Index depuis janvier'!$F$2),INDEX(base_index,,),0))-1","v":5.3202660133006452E-2},{"$f":"SUM(IF((INDEX(base_index,1,)=$A6)*(INDEX(base_index,,1)>='Index depuis janvier'!$C$1)*(INDEX(base_index,,1)<='Index depuis janvier'!$D$1),INDEX(base_index,,),0))/SUM(IF((INDEX(base_index,1,)=$A6)*(INDEX(base_index,,1)>='Index depuis janvier'!$E$1)*(INDEX(base_index,,1)<='Index depuis janvier'!$F$1),INDEX(base_index,,),0))-1","v":5.4217395112551303E-2},"https://www.insee.fr/fr/statistiques/serie/001710987"]
["TP03a",{"$f":"VLOOKUP(A7,'Noms index'!$A$1:$B$23,2,FALSE)","v":"Grands terrassements"},{"$f":"SUM(IF((INDEX(base_index,1,)=$A7)*(INDEX(base_index,,1)>='Index depuis janvier'!$C$2)*(INDEX(base_index,,1)<='Index depuis janvier'!$D$2),INDEX(base_index,,),0))/SUM(IF((INDEX(base_index,1,)=$A7)*(INDEX(base_index,,1)>='Index depuis janvier'!$E$2)*(INDEX(base_index,,1)<='Index depuis janvier'!$F$2),INDEX(base_index,,),0))-1","v":2.7904431880357627E-2},{"$f":"SUM(IF((INDEX(base_index,1,)=$A7)*(INDEX(base_index,,1)>='Index depuis janvier'!$C$1)*(INDEX(base_index,,1)<='Index depuis janvier'!$D$1),INDEX(base_index,,),0))/SUM(IF((INDEX(base_index,1,)=$A7)*(INDEX(base_index,,1)>='Index depuis janvier'!$E$1)*(INDEX(base_index,,1)<='Index depuis janvier'!$F$1),INDEX(base_index,,),0))-1","v":1.999819020903093E-2},"https://www.insee.fr/fr/statistiques/serie/001710988"]
["TP03b",{"$f":"VLOOKUP(A8,'Noms index'!$A$1:$B$23,2,FALSE)","v":"Travaux à l’explosif"},{"$f":"SUM(IF((INDEX(base_index,1,)=$A8)*(INDEX(base_index,,1)>='Index depuis janvier'!$C$2)*(INDEX(base_index,,1)<='Index depuis janvier'!$D$2),INDEX(base_index,,),0))/SUM(IF((INDEX(base_index,1,)=$A8)*(INDEX(base_index,,1)>='Index depuis janvier'!$E$2)*(INDEX(base_index,,1)<='Index depuis janvier'!$F$2),INDEX(base_index,,),0))-1","v":1.8384401114206028E-2},{"$f":"SUM(IF((INDEX(base_index,1,)=$A8)*(INDEX(base_index,,1)>='Index depuis janvier'!$C$1)*(INDEX(base_index,,1)<='Index depuis janvier'!$D$1),INDEX(base_index,,),0))/SUM(IF((INDEX(base_index,1,)=$A8)*(INDEX(base_index,,1)>='Index depuis janvier'!$E$1)*(INDEX(base_index,,1)<='Index depuis janvier'!$F$1),INDEX(base_index,,),0))-1","v":1.2368469632637824E-2},"https://www.insee.fr/fr/statistiques/serie/001710988",null,{"$f":"_xlfn._xlws.SORT('Index depuis janvier'!$A$5:$E$27,3,-1)","v":"TP07b"},"Travaux de génie civil, béton et acier pour ouvrages maritimes",0.22052663076002377,0.15902633074445904,"https://www.insee.fr/fr/statistiques/serie/001710995"]
["TP04",{"$f":"VLOOKUP(A9,'Noms index'!$A$1:$B$23,2,FALSE)","v":"Fondations et travaux géotechniques "},{"$f":"SUM(IF((INDEX(base_index,1,)=$A9)*(INDEX(base_index,,1)>='Index depuis janvier'!$C$2)*(INDEX(base_index,,1)<='Index depuis janvier'!$D$2),INDEX(base_index,,),0))/SUM(IF((INDEX(base_index,1,)=$A9)*(INDEX(base_index,,1)>='Index depuis janvier'!$E$2)*(INDEX(base_index,,1)<='Index depuis janvier'!$F$2),INDEX(base_index,,),0))-1","v":6.691987701211799E-2},{"$f":"SUM(IF((INDEX(base_index,1,)=$A9)*(INDEX(base_index,,1)>='Index depuis janvier'!$C$1)*(INDEX(base_index,,1)<='Index depuis janvier'!$D$1),INDEX(base_index,,),0))/SUM(IF((INDEX(base_index,1,)=$A9)*(INDEX(base_index,,1)>='Index depuis janvier'!$E$1)*(INDEX(base_index,,1)<='Index depuis janvier'!$F$1),INDEX(base_index,,),0))-1","v":5.4805543138131352E-2},"https://www.insee.fr/fr/statistiques/serie/001710990",null,"TP13","Charpentes et ouvrages d’art métalliques ",0.11754068716094035,0.10189890345012032,"https://www.insee.fr/fr/statistiques/serie/001711005"]
["TP05a",{"$f":"VLOOKUP(A10,'Noms index'!$A$1:$B$23,2,FALSE)","v":"Travaux en souterrains traditionnels "},{"$f":"SUM(IF((INDEX(base_index,1,)=$A10)*(INDEX(base_index,,1)>='Index depuis janvier'!$C$2)*(INDEX(base_index,,1)<='Index depuis janvier'!$D$2),INDEX(base_index,,),0))/SUM(IF((INDEX(base_index,1,)=$A10)*(INDEX(base_index,,1)>='Index depuis janvier'!$E$2)*(INDEX(base_index,,1)<='Index depuis janvier'!$F$2),INDEX(base_index,,),0))-1","v":4.4619657736761908E-2},{"$f":"SUM(IF((INDEX(base_index,1,)=$A10)*(INDEX(base_index,,1)>='Index depuis janvier'!$C$1)*(INDEX(base_index,,1)<='Index depuis janvier'!$D$1),INDEX(base_index,,),0))/SUM(IF((INDEX(base_index,1,)=$A10)*(INDEX(base_index,,1)>='Index depuis janvier'!$E$1)*(INDEX(base_index,,1)<='Index depuis janvier'!$F$1),INDEX(base_index,,),0))-1","v":4.387142985047876E-2},"https://www.insee.fr/fr/statistiques/serie/001710991",null,"TP10c","Réhabilitation de canalisations non visitables",0.11555884256263282,7.8469925820001674E-2,"https://www.insee.fr/fr/statistiques/serie/001711000"]
["TP05b",{"$f":"VLOOKUP(A11,'Noms index'!$A$1:$B$23,2,FALSE)","v":"Travaux en souterrains avec tunnelier "},{"$f":"SUM(IF((INDEX(base_index,1,)=$A11)*(INDEX(base_index,,1)>='Index depuis janvier'!$C$2)*(INDEX(base_index,,1)<='Index depuis janvier'!$D$2),INDEX(base_index,,),0))/SUM(IF((INDEX(base_index,1,)=$A11)*(INDEX(base_index,,1)>='Index depuis janvier'!$E$2)*(INDEX(base_index,,1)<='Index depuis janvier'!$F$2),INDEX(base_index,,),0))-1","v":4.3985637342908612E-2},{"$f":"SUM(IF((INDEX(base_index,1,)=$A11)*(INDEX(base_index,,1)>='Index depuis janvier'!$C$1)*(INDEX(base_index,,1)<='Index depuis janvier'!$D$1),INDEX(base_index,,),0))/SUM(IF((INDEX(base_index,1,)=$A11)*(INDEX(base_index,,1)>='Index depuis janvier'!$E$1)*(INDEX(base_index,,1)<='Index depuis janvier'!$F$1),INDEX(base_index,,),0))-1","v":4.3423649739817272E-2},"https://www.insee.fr/fr/statistiques/serie/001710992",null,"TP09","Fabrication et mise en œuvre d’enrobés ",7.3470170727028661E-2,2.3970722781335718E-2,"https://www.insee.fr/fr/statistiques/serie/001710997"]
["TP06a",{"$f":"VLOOKUP(A12,'Noms index'!$A$1:$B$23,2,FALSE)","v":"Grands dragages maritimes "},{"$f":"SUM(IF((INDEX(base_index,1,)=$A12)*(INDEX(base_index,,1)>='Index depuis janvier'!$C$2)*(INDEX(base_index,,1)<='Index depuis janvier'!$D$2),INDEX(base_index,,),0))/SUM(IF((INDEX(base_index,1,)=$A12)*(INDEX(base_index,,1)>='Index depuis janvier'!$E$2)*(INDEX(base_index,,1)<='Index depuis janvier'!$F$2),INDEX(base_index,,),0))-1","v":7.2923510089159871E-2},{"$f":"SUM(IF((INDEX(base_index,1,)=$A12)*(INDEX(base_index,,1)>='Index depuis janvier'!$C$1)*(INDEX(base_index,,1)<='Index depuis janvier'!$D$1),INDEX(base_index,,),0))/SUM(IF((INDEX(base_index,1,)=$A12)*(INDEX(base_index,,1)>='Index depuis janvier'!$E$1)*(INDEX(base_index,,1)<='Index depuis janvier'!$F$1),INDEX(base_index,,),0))-1","v":1.2039660056657242E-2},"https://www.insee.fr/fr/statistiques/serie/001710993",null,"TP06a","Grands dragages maritimes ",7.2923510089159871E-2,1.2039660056657242E-2,"https://www.insee.fr/fr/statistiques/serie/001710993"]
["TP06b",{"$f":"VLOOKUP(A13,'Noms index'!$A$1:$B$23,2,FALSE)","v":"Dragages fluviaux et petits dragages maritimes"},{"$f":"SUM(IF((INDEX(base_index,1,)=$A13)*(INDEX(base_index,,1)>='Index depuis janvier'!$C$2)*(INDEX(base_index,,1)<='Index depuis janvier'!$D$2),INDEX(base_index,,),0))/SUM(IF((INDEX(base_index,1,)=$A13)*(INDEX(base_index,,1)>='Index depuis janvier'!$E$2)*(INDEX(base_index,,1)<='Index depuis janvier'!$F$2),INDEX(base_index,,),0))-1","v":3.0478143349799369E-2},{"$f":"SUM(IF((INDEX(base_index,1,)=$A13)*(INDEX(base_index,,1)>='Index depuis janvier'!$C$1)*(INDEX(base_index,,1)<='Index depuis janvier'!$D$1),INDEX(base_index,,),0))/SUM(IF((INDEX(base_index,1,)=$A13)*(INDEX(base_index,,1)>='Index depuis janvier'!$E$1)*(INDEX(base_index,,1)<='Index depuis janvier'!$F$1),INDEX(base_index,,),0))-1","v":1.2176142085507324E-2},"https://www.insee.fr/fr/statistiques/serie/001710994",null,"TP04","Fondations et travaux géotechniques ",6.691987701211799E-2,5.4805543138131352E-2,"https://www.insee.fr/fr/statistiques/serie/001710990"]
["TP07b",{"$f":"VLOOKUP(A14,'Noms index'!$A$1:$B$23,2,FALSE)","v":"Travaux de génie civil, béton et acier pour ouvrages maritimes"},{"$f":"SUM(IF((INDEX(base_index,1,)=$A14)*(INDEX(base_index,,1)>='Index depuis janvier'!$C$2)*(INDEX(base_index,,1)<='Index depuis janvier'!$D$2),INDEX(base_index,,),0))/SUM(IF((INDEX(base_index,1,)=$A14)*(INDEX(base_index,,1)>='Index depuis janvier'!$E$2)*(INDEX(base_index,,1)<='Index depuis janvier'!$F$2),INDEX(base_index,,),0))-1","v":0.22052663076002377},{"$f":"SUM(IF((INDEX(base_index,1,)=$A14)*(INDEX(base_index,,1)>='Index depuis janvier'!$C$1)*(INDEX(base_index,,1)<='Index depuis janvier'!$D$1),INDEX(base_index,,),0))/SUM(IF((INDEX(base_index,1,)=$A14)*(INDEX(base_index,,1)>='Index depuis janvier'!$E$1)*(INDEX(base_index,,1)<='Index depuis janvier'!$F$1),INDEX(base_index,,),0))-1","v":0.15902633074445904},"https://www.insee.fr/fr/statistiques/serie/001710995",null,"TP02","Travaux de génie civil et d’ouvrages d’art neufs ou rénovation",5.3202660133006452E-2,5.4217395112551303E-2,"https://www.insee.fr/fr/statistiques/serie/001710987"]
["TP08",{"$f":"VLOOKUP(A15,'Noms index'!$A$1:$B$23,2,FALSE)","v":"Travaux d’aménagement et entretien de voirie"},{"$f":"SUM(IF((INDEX(base_index,1,)=$A15)*(INDEX(base_index,,1)>='Index depuis janvier'!$C$2)*(INDEX(base_index,,1)<='Index depuis janvier'!$D$2),INDEX(base_index,,),0))/SUM(IF((INDEX(base_index,1,)=$A15)*(INDEX(base_index,,1)>='Index depuis janvier'!$E$2)*(INDEX(base_index,,1)<='Index depuis janvier'!$F$2),INDEX(base_index,,),0))-1","v":4.1840229565861309E-2},{"$f":"SUM(IF((INDEX(base_index,1,)=$A15)*(INDEX(base_index,,1)>='Index depuis janvier'!$C$1)*(INDEX(base_index,,1)<='Index depuis janvier'!$D$1),INDEX(base_index,,),0))/SUM(IF((INDEX(base_index,1,)=$A15)*(INDEX(base_index,,1)>='Index depuis janvier'!$E$1)*(INDEX(base_index,,1)<='Index depuis janvier'!$F$1),INDEX(base_index,,),0))-1","v":2.3460943893789166E-2},"https://www.insee.fr/fr/statistiques/serie/001710996",null,"TP05a","Travaux en souterrains traditionnels ",4.4619657736761908E-2,4.387142985047876E-2,"https://www.insee.fr/fr/statistiques/serie/001710991"]
["TP09",{"$f":"VLOOKUP(A16,'Noms index'!$A$1:$B$23,2,FALSE)","v":"Fabrication et mise en œuvre d’enrobés "},{"$f":"SUM(IF((INDEX(base_index,1,)=$A16)*(INDEX(base_index,,1)>='Index depuis janvier'!$C$2)*(INDEX(base_index,,1)<='Index depuis janvier'!$D$2),INDEX(base_index,,),0))/SUM(IF((INDEX(base_index,1,)=$A16)*(INDEX(base_index,,1)>='Index depuis janvier'!$E$2)*(INDEX(base_index,,1)<='Index depuis janvier'!$F$2),INDEX(base_index,,),0))-1","v":7.3470170727028661E-2},{"$f":"SUM(IF((INDEX(base_index,1,)=$A16)*(INDEX(base_index,,1)>='Index depuis janvier'!$C$1)*(INDEX(base_index,,1)<='Index depuis janvier'!$D$1),INDEX(base_index,,),0))/SUM(IF((INDEX(base_index,1,)=$A16)*(INDEX(base_index,,1)>='Index depuis janvier'!$E$1)*(INDEX(base_index,,1)<='Index depuis janvier'!$F$1),INDEX(base_index,,),0))-1","v":2.3970722781335718E-2},"https://www.insee.fr/fr/statistiques/serie/001710997",null,"TP05b","Travaux en souterrains avec tunnelier ",4.3985637342908612E-2,4.3423649739817272E-2,"https://www.insee.fr/fr/statistiques/serie/001710992"]
["TP10a",{"$f":"VLOOKUP(A17,'Noms index'!$A$1:$B$23,2,FALSE)","v":"Canalisations, assainissement et adduction d’eau avec fourniture de tuyaux "},{"$f":"SUM(IF((INDEX(base_index,1,)=$A17)*(INDEX(base_index,,1)>='Index depuis janvier'!$C$2)*(INDEX(base_index,,1)<='Index depuis janvier'!$D$2),INDEX(base_index,,),0))/SUM(IF((INDEX(base_index,1,)=$A17)*(INDEX(base_index,,1)>='Index depuis janvier'!$E$2)*(INDEX(base_index,,1)<='Index depuis janvier'!$F$2),INDEX(base_index,,),0))-1","v":3.04889049251309E-2},{"$f":"SUM(IF((INDEX(base_index,1,)=$A17)*(INDEX(base_index,,1)>='Index depuis janvier'!$C$1)*(INDEX(base_index,,1)<='Index depuis janvier'!$D$1),INDEX(base_index,,),0))/SUM(IF((INDEX(base_index,1,)=$A17)*(INDEX(base_index,,1)>='Index depuis janvier'!$E$1)*(INDEX(base_index,,1)<='Index depuis janvier'!$F$1),INDEX(base_index,,),0))-1","v":3.0767842641884036E-2},"https://www.insee.fr/fr/statistiques/serie/001710998",null,"TP08","Travaux d’aménagement et entretien de voirie",4.1840229565861309E-2,2.3460943893789166E-2,"https://www.insee.fr/fr/statistiques/serie/001710996"]
["TP10b",{"$f":"VLOOKUP(A18,'Noms index'!$A$1:$B$23,2,FALSE)","v":"Canalisations sans fourniture de tuyaux"},{"$f":"SUM(IF((INDEX(base_index,1,)=$A18)*(INDEX(base_index,,1)>='Index depuis janvier'!$C$2)*(INDEX(base_index,,1)<='Index depuis janvier'!$D$2),INDEX(base_index,,),0))/SUM(IF((INDEX(base_index,1,)=$A18)*(INDEX(base_index,,1)>='Index depuis janvier'!$E$2)*(INDEX(base_index,,1)<='Index depuis janvier'!$F$2),INDEX(base_index,,),0))-1","v":2.1374315491962559E-2},{"$f":"SUM(IF((INDEX(base_index,1,)=$A18)*(INDEX(base_index,,1)>='Index depuis janvier'!$C$1)*(INDEX(base_index,,1)<='Index depuis janvier'!$D$1),INDEX(base_index,,),0))/SUM(IF((INDEX(base_index,1,)=$A18)*(INDEX(base_index,,1)>='Index depuis janvier'!$E$1)*(INDEX(base_index,,1)<='Index depuis janvier'!$F$1),INDEX(base_index,,),0))-1","v":2.2186864668965134E-2},"https://www.insee.fr/fr/statistiques/serie/001710999",null,"TP01","Index général tous travaux",4.137115839243477E-2,3.0316660669305495E-2,"https://www.insee.fr/fr/statistiques/serie/001711007"]
["TP10c",{"$f":"VLOOKUP(A19,'Noms index'!$A$1:$B$23,2,FALSE)","v":"Réhabilitation de canalisations non visitables"},{"$f":"SUM(IF((INDEX(base_index,1,)=$A19)*(INDEX(base_index,,1)>='Index depuis janvier'!$C$2)*(INDEX(base_index,,1)<='Index depuis janvier'!$D$2),INDEX(base_index,,),0))/SUM(IF((INDEX(base_index,1,)=$A19)*(INDEX(base_index,,1)>='Index depuis janvier'!$E$2)*(INDEX(base_index,,1)<='Index depuis janvier'!$F$2),INDEX(base_index,,),0))-1","v":0.11555884256263282},{"$f":"SUM(IF((INDEX(base_index,1,)=$A19)*(INDEX(base_index,,1)>='Index depuis janvier'!$C$1)*(INDEX(base_index,,1)<='Index depuis janvier'!$D$1),INDEX(base_index,,),0))/SUM(IF((INDEX(base_index,1,)=$A19)*(INDEX(base_index,,1)>='Index depuis janvier'!$E$1)*(INDEX(base_index,,1)<='Index depuis janvier'!$F$1),INDEX(base_index,,),0))-1","v":7.8469925820001674E-2},"https://www.insee.fr/fr/statistiques/serie/001711000",null,"TP11","Canalisations grandes distances de transport / transfert  avec fourniture de tuyaux",4.0271666347809321E-2,3.2567413596658046E-2,"https://www.insee.fr/fr/statistiques/serie/001711001"]
["TP10d",{"$f":"VLOOKUP(A20,'Noms index'!$A$1:$B$23,2,FALSE)","v":"Réseaux de chauffage et de froid avec fourniture de tuyaux"},{"$f":"SUM(IF((INDEX(base_index,1,)=$A20)*(INDEX(base_index,,1)>='Index depuis janvier'!$C$2)*(INDEX(base_index,,1)<='Index depuis janvier'!$D$2),INDEX(base_index,,),0))/SUM(IF((INDEX(base_index,1,)=$A20)*(INDEX(base_index,,1)>='Index depuis janvier'!$E$2)*(INDEX(base_index,,1)<='Index depuis janvier'!$F$2),INDEX(base_index,,),0))-1","v":3.3361847733105021E-2},"-","https://www.insee.fr/fr/statistiques/serie/010605983",null,"TP10d","Réseaux de chauffage et de froid avec fourniture de tuyaux",3.3361847733105021E-2,"-","https://www.insee.fr/fr/statistiques/serie/010605983"]
["TP11",{"$f":"VLOOKUP(A21,'Noms index'!$A$1:$B$23,2,FALSE)","v":"Canalisations grandes distances de transport / transfert  avec fourniture de tuyaux"},{"$f":"SUM(IF((INDEX(base_index,1,)=$A21)*(INDEX(base_index,,1)>='Index depuis janvier'!$C$2)*(INDEX(base_index,,1)<='Index depuis janvier'!$D$2),INDEX(base_index,,),0))/SUM(IF((INDEX(base_index,1,)=$A21)*(INDEX(base_index,,1)>='Index depuis janvier'!$E$2)*(INDEX(base_index,,1)<='Index depuis janvier'!$F$2),INDEX(base_index,,),0))-1","v":4.0271666347809321E-2},{"$f":"SUM(IF((INDEX(base_index,1,)=$A21)*(INDEX(base_index,,1)>='Index depuis janvier'!$C$1)*(INDEX(base_index,,1)<='Index depuis janvier'!$D$1),INDEX(base_index,,),0))/SUM(IF((INDEX(base_index,1,)=$A21)*(INDEX(base_index,,1)>='Index depuis janvier'!$E$1)*(INDEX(base_index,,1)<='Index depuis janvier'!$F$1),INDEX(base_index,,),0))-1","v":3.2567413596658046E-2},"https://www.insee.fr/fr/statistiques/serie/001711001",null,"TP12b","Éclairage public -Travaux d'installation",3.212368079985195E-2,2.3031748944760677E-2,"https://www.insee.fr/fr/statistiques/serie/001711003"]
["TP12a",{"$f":"VLOOKUP(A22,'Noms index'!$A$1:$B$23,2,FALSE)","v":"Réseaux d'énergie et de communication"},{"$f":"SUM(IF((INDEX(base_index,1,)=$A22)*(INDEX(base_index,,1)>='Index depuis janvier'!$C$2)*(INDEX(base_index,,1)<='Index depuis janvier'!$D$2),INDEX(base_index,,),0))/SUM(IF((INDEX(base_index,1,)=$A22)*(INDEX(base_index,,1)>='Index depuis janvier'!$E$2)*(INDEX(base_index,,1)<='Index depuis janvier'!$F$2),INDEX(base_index,,),0))-1","v":2.5311942959001854E-2},{"$f":"SUM(IF((INDEX(base_index,1,)=$A22)*(INDEX(base_index,,1)>='Index depuis janvier'!$C$1)*(INDEX(base_index,,1)<='Index depuis janvier'!$D$1),INDEX(base_index,,),0))/SUM(IF((INDEX(base_index,1,)=$A22)*(INDEX(base_index,,1)>='Index depuis janvier'!$E$1)*(INDEX(base_index,,1)<='Index depuis janvier'!$F$1),INDEX(base_index,,),0))-1","v":2.9809327723569812E-2},"https://www.insee.fr/fr/statistiques/serie/001711002",null,"TP10a","Canalisations, assainissement et adduction d’eau avec fourniture de tuyaux ",3.04889049251309E-2,3.0767842641884036E-2,"https://www.insee.fr/fr/statistiques/serie/001710998"]
["TP12b",{"$f":"VLOOKUP(A23,'Noms index'!$A$1:$B$23,2,FALSE)","v":"Éclairage public -Travaux d'installation"},{"$f":"SUM(IF((INDEX(base_index,1,)=$A23)*(INDEX(base_index,,1)>='Index depuis janvier'!$C$2)*(INDEX(base_index,,1)<='Index depuis janvier'!$D$2),INDEX(base_index,,),0))/SUM(IF((INDEX(base_index,1,)=$A23)*(INDEX(base_index,,1)>='Index depuis janvier'!$E$2)*(INDEX(base_index,,1)<='Index depuis janvier'!$F$2),INDEX(base_index,,),0))-1","v":3.212368079985195E-2},{"$f":"SUM(IF((INDEX(base_index,1,)=$A23)*(INDEX(base_index,,1)>='Index depuis janvier'!$C$1)*(INDEX(base_index,,1)<='Index depuis janvier'!$D$1),INDEX(base_index,,),0))/SUM(IF((INDEX(base_index,1,)=$A23)*(INDEX(base_index,,1)>='Index depuis janvier'!$E$1)*(INDEX(base_index,,1)<='Index depuis janvier'!$F$1),INDEX(base_index,,),0))-1","v":2.3031748944760677E-2},"https://www.insee.fr/fr/statistiques/serie/001711003",null,"TP06b","Dragages fluviaux et petits dragages maritimes",3.0478143349799369E-2,1.2176142085507324E-2,"https://www.insee.fr/fr/statistiques/serie/001710994"]
["TP12c",{"$f":"VLOOKUP(A24,'Noms index'!$A$1:$B$23,2,FALSE)","v":"Éclairage public - Travaux  de maintenance"},{"$f":"SUM(IF((INDEX(base_index,1,)=$A24)*(INDEX(base_index,,1)>='Index depuis janvier'!$C$2)*(INDEX(base_index,,1)<='Index depuis janvier'!$D$2),INDEX(base_index,,),0))/SUM(IF((INDEX(base_index,1,)=$A24)*(INDEX(base_index,,1)>='Index depuis janvier'!$E$2)*(INDEX(base_index,,1)<='Index depuis janvier'!$F$2),INDEX(base_index,,),0))-1","v":4.7182175622542122E-3},{"$f":"SUM(IF((INDEX(base_index,1,)=$A24)*(INDEX(base_index,,1)>='Index depuis janvier'!$C$1)*(INDEX(base_index,,1)<='Index depuis janvier'!$D$1),INDEX(base_index,,),0))/SUM(IF((INDEX(base_index,1,)=$A24)*(INDEX(base_index,,1)>='Index depuis janvier'!$E$1)*(INDEX(base_index,,1)<='Index depuis janvier'!$F$1),INDEX(base_index,,),0))-1","v":8.7726993595929059E-3},"https://www.insee.fr/fr/statistiques/serie/001711004",null,"TP03a","Grands terrassements",2.7904431880357627E-2,1.999819020903093E-2,"https://www.insee.fr/fr/statistiques/serie/001710988"]
["TP12d",{"$f":"VLOOKUP(A25,'Noms index'!$A$1:$B$23,2,FALSE)","v":"Réseaux de communication en fibre optique"},{"$f":"SUM(IF((INDEX(base_index,1,)=$A25)*(INDEX(base_index,,1)>='Index depuis janvier'!$C$2)*(INDEX(base_index,,1)<='Index depuis janvier'!$D$2),INDEX(base_index,,),0))/SUM(IF((INDEX(base_index,1,)=$A25)*(INDEX(base_index,,1)>='Index depuis janvier'!$E$2)*(INDEX(base_index,,1)<='Index depuis janvier'!$F$2),INDEX(base_index,,),0))-1","v":3.4710170079834679E-3},{"$f":"SUM(IF((INDEX(base_index,1,)=$A25)*(INDEX(base_index,,1)>='Index depuis janvier'!$C$1)*(INDEX(base_index,,1)<='Index depuis janvier'!$D$1),INDEX(base_index,,),0))/SUM(IF((INDEX(base_index,1,)=$A25)*(INDEX(base_index,,1)>='Index depuis janvier'!$E$1)*(INDEX(base_index,,1)<='Index depuis janvier'!$F$1),INDEX(base_index,,),0))-1","v":9.6917838121017841E-3},"https://www.insee.fr/fr/statistiques/serie/001796841",null,"TP12a","Réseaux d'énergie et de communication",2.5311942959001854E-2,2.9809327723569812E-2,"https://www.insee.fr/fr/statistiques/serie/001711002"]
["TP13",{"$f":"VLOOKUP(A26,'Noms index'!$A$1:$B$23,2,FALSE)","v":"Charpentes et ouvrages d’art métalliques "},{"$f":"SUM(IF((INDEX(base_index,1,)=$A26)*(INDEX(base_index,,1)>='Index depuis janvier'!$C$2)*(INDEX(base_index,,1)<='Index depuis janvier'!$D$2),INDEX(base_index,,),0))/SUM(IF((INDEX(base_index,1,)=$A26)*(INDEX(base_index,,1)>='Index depuis janvier'!$E$2)*(INDEX(base_index,,1)<='Index depuis janvier'!$F$2),INDEX(base_index,,),0))-1","v":0.11754068716094035},{"$f":"SUM(IF((INDEX(base_index,1,)=$A26)*(INDEX(base_index,,1)>='Index depuis janvier'!$C$1)*(INDEX(base_index,,1)<='Index depuis janvier'!$D$1),INDEX(base_index,,),0))/SUM(IF((INDEX(base_index,1,)=$A26)*(INDEX(base_index,,1)>='Index depuis janvier'!$E$1)*(INDEX(base_index,,1)<='Index depuis janvier'!$F$1),INDEX(base_index,,),0))-1","v":0.10189890345012032},"https://www.insee.fr/fr/statistiques/serie/001711005",null,"TP10b","Canalisations sans fourniture de tuyaux",2.1374315491962559E-2,2.2186864668965134E-2,"https://www.insee.fr/fr/statistiques/serie/001710999"]
["TP14",{"$f":"VLOOKUP(A27,'Noms index'!$A$1:$B$23,2,FALSE)","v":"Travaux immergés par scaphandriers"},{"$f":"SUM(IF((INDEX(base_index,1,)=$A27)*(INDEX(base_index,,1)>='Index depuis janvier'!$C$2)*(INDEX(base_index,,1)<='Index depuis janvier'!$D$2),INDEX(base_index,,),0))/SUM(IF((INDEX(base_index,1,)=$A27)*(INDEX(base_index,,1)>='Index depuis janvier'!$E$2)*(INDEX(base_index,,1)<='Index depuis janvier'!$F$2),INDEX(base_index,,),0))-1","v":1.092611862643067E-2},{"$f":"SUM(IF((INDEX(base_index,1,)=$A27)*(INDEX(base_index,,1)>='Index depuis janvier'!$C$1)*(INDEX(base_index,,1)<='Index depuis janvier'!$D$1),INDEX(base_index,,),0))/SUM(IF((INDEX(base_index,1,)=$A27)*(INDEX(base_index,,1)>='Index depuis janvier'!$E$1)*(INDEX(base_index,,1)<='Index depuis janvier'!$F$1),INDEX(base_index,,),0))-1","v":1.4003653126902327E-2},"https://www.insee.fr/fr/statistiques/serie/001711006",null,"TP03b","Travaux à l’explosif",1.8384401114206028E-2,1.2368469632637824E-2,"https://www.insee.fr/fr/statistiques/serie/001710988"]
[null,null,null,null,null,null,"TP14","Travaux immergés par scaphandriers",1.092611862643067E-2,1.4003653126902327E-2,"https://www.insee.fr/fr/statistiques/serie/001711006"]
[null,null,null,null,null,null,"TP12c","Éclairage public - Travaux  de maintenance",4.7182175622542122E-3,8.7726993595929059E-3,"https://www.insee.fr/fr/statistiques/serie/001711004"]
[null,null,null,null,null,null,"TP12d","Réseaux de communication en fibre optique",3.4710170079834679E-3,9.6917838121017841E-3,"https://www.insee.fr/fr/statistiques/serie/001796841"]

{"sheet":"Données cumul depuis janvier","index":9,"n_rows":88,"n_cols":11,"rows_kept":88,"cut":false,"hidden":true,"merged":[]}
[null,"2021-01-01",{"$f":"DATE(2021,MONTH(date),1)","v":"2021-10-01"},"2019-01-01",{"$f":"DATE(2019,MONTH(date),1)","v":"2019-10-01"}]
[]
[{"$f":"SUM(IF((INDEX(compo,2,)=\"TP01\")*(INDEX(compo,,1)=$C$13),INDEX(compo,,),0))","v":0.1},"2021-01-01",{"$f":"DATE(2021,MONTH(date),1)","v":"2021-10-01"},"2020-01-01",{"$f":"DATE(2020,MONTH(date),1)","v":"2020-10-01"}]
[]
["K","Matériel",{"$f":"SUM(IF((INDEX(compo,1,)='Données cumul depuis janvier'!A5)*(INDEX(compo,,1)=$A$52),INDEX(compo,,),0))","v":0.15},null,null,null,"001711009","Matériel"]
["L","Travail",{"$f":"SUM(IF((INDEX(compo,1,)='Données cumul depuis janvier'!A6)*(INDEX(compo,,1)=$A$52),INDEX(compo,,),0))","v":0.55000000000000004},null,null,null,"5540998","Travail"]
["E","Energie",{"$f":"SUM(IF((INDEX(compo,1,)='Données cumul depuis janvier'!A7)*(INDEX(compo,,1)=$A$52),INDEX(compo,,),0))","v":0.01},null,null,null,"010534596","GNR"]
["M","Matériaux",{"$f":"SUM(IF((INDEX(compo,1,)='Données cumul depuis janvier'!A8)*(INDEX(compo,,1)=$A$52),INDEX(compo,,),0))","v":0.27},null,null,null,"001764283","Gazole"]
["S","Frais divers",{"$f":"SUM(IF((INDEX(compo,1,)='Données cumul depuis janvier'!A9)*(INDEX(compo,,1)=$A$52),INDEX(compo,,),0))","v":0.01},null,null,null,"001711011","Frais divers"]
["T","Transport",{"$f":"SUM(IF((INDEX(compo,1,)='Données cumul depuis janvier'!A10)*(INDEX(compo,,1)=$A$52),INDEX(compo,,),0))","v":0.01},null,null,null,"001711943","Transports routiers"]
["D","Déchets",{"$f":"SUM(IF((INDEX(compo,1,)='Données cumul depuis janvier'!A11)*(INDEX(compo,,1)=$A$52),INDEX(compo,,),0))","v":0}]
[null,null,null,"Matériel","Travail","GNR",{"$f":"HLOOKUP(G13,'Indice prix'!$B$2:$AP$5,4,FALSE)","v":"Béton prêt à l'emploi"},{"$f":"HLOOKUP(H13,'Indice prix'!$B$2:$AP$5,4,FALSE)","v":"Barres crénelées ou nervurées pour béton armé"}]
[null,"TP01",{"$f":"'Résultats depuis janvier'!B4","v":"TP02"},{"$f":"HLOOKUP(D12,'Composition index'!$A$2:$AR$3,2,FALSE)","v":"001711009"},{"$f":"HLOOKUP(E12,'Composition index'!$A$2:$AR$3,2,FALSE)","v":"5540998"},{"$f":"HLOOKUP(F12,'Composition index'!$A$2:$AR$3,2,FALSE)","v":"010534596"},{"$f":"IF(D54>0,E54,\"\")","v":"010534646"},{"$f":"IF(D55>0,E55,\"\")","v":"010546545"}]
[{"$f":"DATE(2018,MONTH(date),1)","v":"2018-10-01"},{"$f":"IF(A14>date,\"\",SUM(IF((INDEX(base_index,1,)=B$13)*(INDEX(base_index,,1)=$A14),INDEX(base_index,,),0)))","v":110.9},{"$f":"IF(A14>date,\"\",IF((SUM(IF((INDEX(base_index,1,)=C$13)*(INDEX(base_index,,1)=$A14),INDEX(base_index,,),0)))=0,#N/A,SUM(IF((INDEX(base_index,1,)=C$13)*(INDEX(base_index,,1)=$A14),INDEX(base_index,,),0))))","v":113},{"$f":"IF(A14>date,\"\",SUM(IF((INDEX(base_indices,1,)=D$13)*(INDEX(base_indices,,1)=$A14),INDEX(base_indices,,),0)))","v":104.3},{"$f":"IF(A14>date,\"\",SUM(IF((INDEX(base_indices,1,)=E$13)*(INDEX(base_indices,,1)=$A14),INDEX(base_indices,,),0)))","v":119.7},{"$f":"IF(A14>date,\"\",SUM(IF((INDEX(base_indices,1,)=F$13)*(INDEX(base_indices,,1)=$A14),INDEX(base_indices,,),0)))","v":132.80000000000001},{"$f":"IF(A14>date,\"\",IF(OR(G$13=\"\",G$13=\"Fioul lourd\"),#N/A,SUM(IF((INDEX(base_indices,1,)=G$13)*(INDEX(base_indices,,1)=$A14),INDEX(base_indices,,),0))))","v":102.2},{"$f":"IF(A14>date,\"\",IF(OR(H$13=\"\",H$13=\"Fioul lourd\"),#N/A,SUM(IF((INDEX(base_indices,1,)=H$13)*(INDEX(base_indices,,1)=$A14),INDEX(base_indices,,),0))))","v":127.8}]
[{"$f":"EDATE(A14,1)","v":"2018-11-01"},{"$f":"IF(A15>date,\"\",SUM(IF((INDEX(base_index,1,)=B$13)*(INDEX(base_index,,1)=$A15),INDEX(base_index,,),0)))","v":111.1},{"$f":"IF(A15>date,\"\",IF((SUM(IF((INDEX(base_index,1,)=C$13)*(INDEX(base_index,,1)=$A15),INDEX(base_index,,),0)))=0,#N/A,SUM(IF((INDEX(base_index,1,)=C$13)*(INDEX(base_index,,1)=$A15),INDEX(base_index,,),0))))","v":113.1},{"$f":"IF(A15>date,\"\",SUM(IF((INDEX(base_indices,1,)=D$13)*(INDEX(base_indices,,1)=$A15),INDEX(base_indices,,),0)))","v":104.3},{"$f":"IF(A15>date,\"\",SUM(IF((INDEX(base_indices,1,)=E$13)*(INDEX(base_indices,,1)=$A15),INDEX(base_indices,,),0)))","v":120},{"$f":"IF(A15>date,\"\",SUM(IF((INDEX(base_indices,1,)=F$13)*(INDEX(base_indices,,1)=$A15),INDEX(base_indices,,),0)))","v":125.8},{"$f":"IF(A15>date,\"\",IF(OR(G$13=\"\",G$13=\"Fioul lourd\"),#N/A,SUM(IF((INDEX(base_indices,1,)=G$13)*(INDEX(base_indices,,1)=$A15),INDEX(base_indices,,),0))))","v":102.4},{"$f":"IF(A15>date,\"\",IF(OR(H$13=\"\",H$13=\"Fioul lourd\"),#N/A,SUM(IF((INDEX(base_indices,1,)=H$13)*(INDEX(base_indices,,1)=$A15),INDEX(base_indices,,),0))))","v":126.6}]
[{"$f":"EDATE(A15,1)","v":"2018-12-01"},{"$f":"IF(A16>date,\"\",SUM(IF((INDEX(base_index,1,)=B$13)*(INDEX(base_index,,1)=$A16),INDEX(base_index,,),0)))","v":110},{"$f":"IF(A16>date,\"\",IF((SUM(IF((INDEX(base_index,1,)=C$13)*(INDEX(base_index,,1)=$A16),INDEX(base_index,,),0)))=0,#N/A,SUM(IF((INDEX(base_index,1,)=C$13)*(INDEX(base_index,,1)=$A16),INDEX(base_index,,),0))))","v":113.2},{"$f":"IF(A16>date,\"\",SUM(IF((INDEX(base_indices,1,)=D$13)*(INDEX(base_indices,,1)=$A16),INDEX(base_indices,,),0)))","v":104.1},{"$f":"IF(A16>date,\"\",SUM(IF((INDEX(base_indices,1,)=E$13)*(INDEX(base_indices,,1)=$A16),INDEX(base_indices,,),0)))","v":120.2},{"$f":"IF(A16>date,\"\",SUM(IF((INDEX(base_indices,1,)=F$13)*(INDEX(base_indices,,1)=$A16),INDEX(base_indices,,),0)))","v":118.1},{"$f":"IF(A16>date,\"\",IF(OR(G$13=\"\",G$13=\"Fioul lourd\"),#N/A,SUM(IF((INDEX(base_indices,1,)=G$13)*(INDEX(base_indices,,1)=$A16),INDEX(base_indices,,),0))))","v":102.2},{"$f":"IF(A16>date,\"\",IF(OR(H$13=\"\",H$13=\"Fioul lourd\"),#N/A,SUM(IF((INDEX(base_indices,1,)=H$13)*(INDEX(base_indices,,1)=$A16),INDEX(base_indices,,),0))))","v":125.5}]
["2019-01-01",{"$f":"IF(A17>date,\"\",SUM(IF((INDEX(base_index,1,)=B$13)*(INDEX(base_index,,1)=$A17),INDEX(base_index,,),0)))","v":109.7},{"$f":"IF(A17>date,\"\",IF((SUM(IF((INDEX(base_index,1,)=C$13)*(INDEX(base_index,,1)=$A17),INDEX(base_index,,),0)))=0,#N/A,SUM(IF((INDEX(base_index,1,)=C$13)*(INDEX(base_index,,1)=$A17),INDEX(base_index,,),0))))","v":113.5},{"$f":"IF(A17>date,\"\",SUM(IF((INDEX(base_indices,1,)=D$13)*(INDEX(base_indices,,1)=$A17),INDEX(base_indices,,),0)))","v":104.7},{"$f":"IF(A17>date,\"\",SUM(IF((INDEX(base_indices,1,)=E$13)*(INDEX(base_indices,,1)=$A17),INDEX(base_indices,,),0)))","v":120.8},{"$f":"IF(A17>date,\"\",SUM(IF((INDEX(base_indices,1,)=F$13)*(INDEX(base_indices,,1)=$A17),INDEX(base_indices,,),0)))","v":118.2},{"$f":"IF(A17>date,\"\",IF(OR(G$13=\"\",G$13=\"Fioul lourd\"),#N/A,SUM(IF((INDEX(base_indices,1,)=G$13)*(INDEX(base_indices,,1)=$A17),INDEX(base_indices,,),0))))","v":103.8},{"$f":"IF(A17>date,\"\",IF(OR(H$13=\"\",H$13=\"Fioul lourd\"),#N/A,SUM(IF((INDEX(base_indices,1,)=H$13)*(INDEX(base_indices,,1)=$A17),INDEX(base_indices,,),0))))","v":124.6}]
["2019-02-01",{"$f":"IF(A18>date,\"\",SUM(IF((INDEX(base_index,1,)=B$13)*(INDEX(base_index,,1)=$A18),INDEX(base_index,,),0)))","v":110.3},{"$f":"IF(A18>date,\"\",IF((SUM(IF((INDEX(base_index,1,)=C$13)*(INDEX(base_index,,1)=$A18),INDEX(base_index,,),0)))=0,#N/A,SUM(IF((INDEX(base_index,1,)=C$13)*(INDEX(base_index,,1)=$A18),INDEX(base_index,,),0))))","v":113.6},{"$f":"IF(A18>date,\"\",SUM(IF((INDEX(base_indices,1,)=D$13)*(INDEX(base_indices,,1)=$A18),INDEX(base_indices,,),0)))","v":104.7},{"$f":"IF(A18>date,\"\",SUM(IF((INDEX(base_indices,1,)=E$13)*(INDEX(base_indices,,1)=$A18),INDEX(base_indices,,),0)))","v":121.4},{"$f":"IF(A18>date,\"\",SUM(IF((INDEX(base_indices,1,)=F$13)*(INDEX(base_indices,,1)=$A18),INDEX(base_indices,,),0)))","v":122.5},{"$f":"IF(A18>date,\"\",IF(OR(G$13=\"\",G$13=\"Fioul lourd\"),#N/A,SUM(IF((INDEX(base_indices,1,)=G$13)*(INDEX(base_indices,,1)=$A18),INDEX(base_indices,,),0))))","v":104.2},{"$f":"IF(A18>date,\"\",IF(OR(H$13=\"\",H$13=\"Fioul lourd\"),#N/A,SUM(IF((INDEX(base_indices,1,)=H$13)*(INDEX(base_indices,,1)=$A18),INDEX(base_indices,,),0))))","v":123.8}]
["2019-03-01",{"$f":"IF(A19>date,\"\",SUM(IF((INDEX(base_index,1,)=B$13)*(INDEX(base_index,,1)=$A19),INDEX(base_index,,),0)))","v":111.3},{"$f":"IF(A19>date,\"\",IF((SUM(IF((INDEX(base_index,1,)=C$13)*(INDEX(base_index,,1)=$A19),INDEX(base_index,,),0)))=0,#N/A,SUM(IF((INDEX(base_index,1,)=C$13)*(INDEX(base_index,,1)=$A19),INDEX(base_index,,),0))))","v":114.1},{"$f":"IF(A19>date,\"\",SUM(IF((INDEX(base_indices,1,)=D$13)*(INDEX(base_indices,,1)=$A19),INDEX(base_indices,,),0)))","v":105.7},{"$f":"IF(A19>date,\"\",SUM(IF((INDEX(base_indices,1,)=E$13)*(INDEX(base_indices,,1)=$A19),INDEX(base_indices,,),0)))","v":122},{"$f":"IF(A19>date,\"\",SUM(IF((INDEX(base_indices,1,)=F$13)*(INDEX(base_indices,,1)=$A19),INDEX(base_indices,,),0)))","v":123.5},{"$f":"IF(A19>date,\"\",IF(OR(G$13=\"\",G$13=\"Fioul lourd\"),#N/A,SUM(IF((INDEX(base_indices,1,)=G$13)*(INDEX(base_indices,,1)=$A19),INDEX(base_indices,,),0))))","v":104.3},{"$f":"IF(A19>date,\"\",IF(OR(H$13=\"\",H$13=\"Fioul lourd\"),#N/A,SUM(IF((INDEX(base_indices,1,)=H$13)*(INDEX(base_indices,,1)=$A19),INDEX(base_indices,,),0))))","v":123.9}]
["2019-04-01",{"$f":"IF(A20>date,\"\",SUM(IF((INDEX(base_index,1,)=B$13)*(INDEX(base_index,,1)=$A20),INDEX(base_index,,),0)))","v":111.6},{"$f":"IF(A20>date,\"\",IF((SUM(IF((INDEX(base_index,1,)=C$13)*(INDEX(base_index,,1)=$A20),INDEX(base_index,,),0)))=0,#N/A,SUM(IF((INDEX(base_index,1,)=C$13)*(INDEX(base_index,,1)=$A20),INDEX(base_index,,),0))))","v":114.1},{"$f":"IF(A20>date,\"\",SUM(IF((INDEX(base_indices,1,)=D$13)*(INDEX(base_indices,,1)=$A20),INDEX(base_indices,,),0)))","v":105.3},{"$f":"IF(A20>date,\"\",SUM(IF((INDEX(base_indices,1,)=E$13)*(INDEX(base_indices,,1)=$A20),INDEX(base_indices,,),0)))","v":122.3},{"$f":"IF(A20>date,\"\",SUM(IF((INDEX(base_indices,1,)=F$13)*(INDEX(base_indices,,1)=$A20),INDEX(base_indices,,),0)))","v":125.8},{"$f":"IF(A20>date,\"\",IF(OR(G$13=\"\",G$13=\"Fioul lourd\"),#N/A,SUM(IF((INDEX(base_indices,1,)=G$13)*(INDEX(base_indices,,1)=$A20),INDEX(base_indices,,),0))))","v":104.1},{"$f":"IF(A20>date,\"\",IF(OR(H$13=\"\",H$13=\"Fioul lourd\"),#N/A,SUM(IF((INDEX(base_indices,1,)=H$13)*(INDEX(base_indices,,1)=$A20),INDEX(base_indices,,),0))))","v":123.8}]
["2019-05-01",{"$f":"IF(A21>date,\"\",SUM(IF((INDEX(base_index,1,)=B$13)*(INDEX(base_index,,1)=$A21),INDEX(base_index,,),0)))","v":111.8},{"$f":"IF(A21>date,\"\",IF((SUM(IF((INDEX(base_index,1,)=C$13)*(INDEX(base_index,,1)=$A21),INDEX(base_index,,),0)))=0,#N/A,SUM(IF((INDEX(base_index,1,)=C$13)*(INDEX(base_index,,1)=$A21),INDEX(base_index,,),0))))","v":114.1},{"$f":"IF(A21>date,\"\",SUM(IF((INDEX(base_indices,1,)=D$13)*(INDEX(base_indices,,1)=$A21),INDEX(base_indices,,),0)))","v":105},{"$f":"IF(A21>date,\"\",SUM(IF((INDEX(base_indices,1,)=E$13)*(INDEX(base_indices,,1)=$A21),INDEX(base_indices,,),0)))","v":122.5},{"$f":"IF(A21>date,\"\",SUM(IF((INDEX(base_indices,1,)=F$13)*(INDEX(base_indices,,1)=$A21),INDEX(base_indices,,),0)))","v":126.4},{"$f":"IF(A21>date,\"\",IF(OR(G$13=\"\",G$13=\"Fioul lourd\"),#N/A,SUM(IF((INDEX(base_indices,1,)=G$13)*(INDEX(base_indices,,1)=$A21),INDEX(base_indices,,),0))))","v":104.9},{"$f":"IF(A21>date,\"\",IF(OR(H$13=\"\",H$13=\"Fioul lourd\"),#N/A,SUM(IF((INDEX(base_indices,1,)=H$13)*(INDEX(base_indices,,1)=$A21),INDEX(base_indices,,),0))))","v":123}]
["2019-06-01",{"$f":"IF(A22>date,\"\",SUM(IF((INDEX(base_index,1,)=B$13)*(INDEX(base_index,,1)=$A22),INDEX(base_index,,),0)))","v":111.5},{"$f":"IF(A22>date,\"\",IF((SUM(IF((INDEX(base_index,1,)=C$13)*(INDEX(base_index,,1)=$A22),INDEX(base_index,,),0)))=0,#N/A,SUM(IF((INDEX(base_index,1,)=C$13)*(INDEX(base_index,,1)=$A22),INDEX(base_index,,),0))))","v":114.3},{"$f":"IF(A22>date,\"\",SUM(IF((INDEX(base_indices,1,)=D$13)*(INDEX(base_indices,,1)=$A22),INDEX(base_indices,,),0)))","v":104.9},{"$f":"IF(A22>date,\"\",SUM(IF((INDEX(base_indices,1,)=E$13)*(INDEX(base_indices,,1)=$A22),INDEX(base_indices,,),0)))","v":122.7},{"$f":"IF(A22>date,\"\",SUM(IF((INDEX(base_indices,1,)=F$13)*(INDEX(base_indices,,1)=$A22),INDEX(base_indices,,),0)))","v":119.9},{"$f":"IF(A22>date,\"\",IF(OR(G$13=\"\",G$13=\"Fioul lourd\"),#N/A,SUM(IF((INDEX(base_indices,1,)=G$13)*(INDEX(base_indices,,1)=$A22),INDEX(base_indices,,),0))))","v":105.3},{"$f":"IF(A22>date,\"\",IF(OR(H$13=\"\",H$13=\"Fioul lourd\"),#N/A,SUM(IF((INDEX(base_indices,1,)=H$13)*(INDEX(base_indices,,1)=$A22),INDEX(base_indices,,),0))))","v":122}]
["2019-07-01",{"$f":"IF(A23>date,\"\",SUM(IF((INDEX(base_index,1,)=B$13)*(INDEX(base_index,,1)=$A23),INDEX(base_index,,),0)))","v":111.5},{"$f":"IF(A23>date,\"\",IF((SUM(IF((INDEX(base_index,1,)=C$13)*(INDEX(base_index,,1)=$A23),INDEX(base_index,,),0)))=0,#N/A,SUM(IF((INDEX(base_index,1,)=C$13)*(INDEX(base_index,,1)=$A23),INDEX(base_index,,),0))))","v":114.5},{"$f":"IF(A23>date,\"\",SUM(IF((INDEX(base_indices,1,)=D$13)*(INDEX(base_indices,,1)=$A23),INDEX(base_indices,,),0)))","v":105},{"$f":"IF(A23>date,\"\",SUM(IF((INDEX(base_indices,1,)=E$13)*(INDEX(base_indices,,1)=$A23),INDEX(base_indices,,),0)))","v":122.9},{"$f":"IF(A23>date,\"\",SUM(IF((INDEX(base_indices,1,)=F$13)*(INDEX(base_indices,,1)=$A23),INDEX(base_indices,,),0)))","v":121.5},{"$f":"IF(A23>date,\"\",IF(OR(G$13=\"\",G$13=\"Fioul lourd\"),#N/A,SUM(IF((INDEX(base_indices,1,)=G$13)*(INDEX(base_indices,,1)=$A23),INDEX(base_indices,,),0))))","v":105.4},{"$f":"IF(A23>date,\"\",IF(OR(H$13=\"\",H$13=\"Fioul lourd\"),#N/A,SUM(IF((INDEX(base_indices,1,)=H$13)*(INDEX(base_indices,,1)=$A23),INDEX(base_indices,,),0))))","v":120.5}]
["2019-08-01",{"$f":"IF(A24>date,\"\",SUM(IF((INDEX(base_index,1,)=B$13)*(INDEX(base_index,,1)=$A24),INDEX(base_index,,),0)))","v":111.5},{"$f":"IF(A24>date,\"\",IF((SUM(IF((INDEX(base_index,1,)=C$13)*(INDEX(base_index,,1)=$A24),INDEX(base_index,,),0)))=0,#N/A,SUM(IF((INDEX(base_index,1,)=C$13)*(INDEX(base_index,,1)=$A24),INDEX(base_index,,),0))))","v":114.7},{"$f":"IF(A24>date,\"\",SUM(IF((INDEX(base_indices,1,)=D$13)*(INDEX(base_indices,,1)=$A24),INDEX(base_indices,,),0)))","v":105.1},{"$f":"IF(A24>date,\"\",SUM(IF((INDEX(base_indices,1,)=E$13)*(INDEX(base_indices,,1)=$A24),INDEX(base_indices,,),0)))","v":123.1},{"$f":"IF(A24>date,\"\",SUM(IF((INDEX(base_indices,1,)=F$13)*(INDEX(base_indices,,1)=$A24),INDEX(base_indices,,),0)))","v":119.9},{"$f":"IF(A24>date,\"\",IF(OR(G$13=\"\",G$13=\"Fioul lourd\"),#N/A,SUM(IF((INDEX(base_indices,1,)=G$13)*(INDEX(base_indices,,1)=$A24),INDEX(base_indices,,),0))))","v":106.7},{"$f":"IF(A24>date,\"\",IF(OR(H$13=\"\",H$13=\"Fioul lourd\"),#N/A,SUM(IF((INDEX(base_indices,1,)=H$13)*(INDEX(base_indices,,1)=$A24),INDEX(base_indices,,),0))))","v":119.8}]
["2019-09-01",{"$f":"IF(A25>date,\"\",SUM(IF((INDEX(base_index,1,)=B$13)*(INDEX(base_index,,1)=$A25),INDEX(base_index,,),0)))","v":111.2},{"$f":"IF(A25>date,\"\",IF((SUM(IF((INDEX(base_index,1,)=C$13)*(INDEX(base_index,,1)=$A25),INDEX(base_index,,),0)))=0,#N/A,SUM(IF((INDEX(base_index,1,)=C$13)*(INDEX(base_index,,1)=$A25),INDEX(base_index,,),0))))","v":114.6},{"$f":"IF(A25>date,\"\",SUM(IF((INDEX(base_indices,1,)=D$13)*(INDEX(base_indices,,1)=$A25),INDEX(base_indices,,),0)))","v":105.7},{"$f":"IF(A25>date,\"\",SUM(IF((INDEX(base_indices,1,)=E$13)*(INDEX(base_indices,,1)=$A25),INDEX(base_indices,,),0)))","v":123.3},{"$f":"IF(A25>date,\"\",SUM(IF((INDEX(base_indices,1,)=F$13)*(INDEX(base_indices,,1)=$A25),INDEX(base_indices,,),0)))","v":123.3},{"$f":"IF(A25>date,\"\",IF(OR(G$13=\"\",G$13=\"Fioul lourd\"),#N/A,SUM(IF((INDEX(base_indices,1,)=G$13)*(INDEX(base_indices,,1)=$A25),INDEX(base_indices,,),0))))","v":105.2},{"$f":"IF(A25>date,\"\",IF(OR(H$13=\"\",H$13=\"Fioul lourd\"),#N/A,SUM(IF((INDEX(base_indices,1,)=H$13)*(INDEX(base_indices,,1)=$A25),INDEX(base_indices,,),0))))","v":118.3}]
["2019-10-01",{"$f":"IF(A26>date,\"\",SUM(IF((INDEX(base_index,1,)=B$13)*(INDEX(base_index,,1)=$A26),INDEX(base_index,,),0)))","v":111.2},{"$f":"IF(A26>date,\"\",IF((SUM(IF((INDEX(base_index,1,)=C$13)*(INDEX(base_index,,1)=$A26),INDEX(base_index,,),0)))=0,#N/A,SUM(IF((INDEX(base_index,1,)=C$13)*(INDEX(base_index,,1)=$A26),INDEX(base_index,,),0))))","v":114.2},{"$f":"IF(A26>date,\"\",SUM(IF((INDEX(base_indices,1,)=D$13)*(INDEX(base_indices,,1)=$A26),INDEX(base_indices,,),0)))","v":105.6},{"$f":"IF(A26>date,\"\",SUM(IF((INDEX(base_indices,1,)=E$13)*(INDEX(base_indices,,1)=$A26),INDEX(base_indices,,),0)))","v":123.5},{"$f":"IF(A26>date,\"\",SUM(IF((INDEX(base_indices,1,)=F$13)*(INDEX(base_indices,,1)=$A26),INDEX(base_indices,,),0)))","v":122.4},{"$f":"IF(A26>date,\"\",IF(OR(G$13=\"\",G$13=\"Fioul lourd\"),#N/A,SUM(IF((INDEX(base_indices,1,)=G$13)*(INDEX(base_indices,,1)=$A26),INDEX(base_indices,,),0))))","v":104.7},{"$f":"IF(A26>date,\"\",IF(OR(H$13=\"\",H$13=\"Fioul lourd\"),#N/A,SUM(IF((INDEX(base_indices,1,)=H$13)*(INDEX(base_indices,,1)=$A26),INDEX(base_indices,,),0))))","v":114.1}]
["2019-11-01",{"$f":"IF(A27>date,\"\",SUM(IF((INDEX(base_index,1,)=B$13)*(INDEX(base_index,,1)=$A27),INDEX(base_index,,),0)))","v":110.5},{"$f":"IF(A27>date,\"\",IF((SUM(IF((INDEX(base_index,1,)=C$13)*(INDEX(base_index,,1)=$A27),INDEX(base_index,,),0)))=0,#N/A,SUM(IF((INDEX(base_index,1,)=C$13)*(INDEX(base_index,,1)=$A27),INDEX(base_index,,),0))))","v":114.2},{"$f":"IF(A27>date,\"\",SUM(IF((INDEX(base_indices,1,)=D$13)*(INDEX(base_indices,,1)=$A27),INDEX(base_indices,,),0)))","v":105.1},{"$f":"IF(A27>date,\"\",SUM(IF((INDEX(base_indices,1,)=E$13)*(INDEX(base_indices,,1)=$A27),INDEX(base_indices,,),0)))","v":123.7},{"$f":"IF(A27>date,\"\",SUM(IF((INDEX(base_indices,1,)=F$13)*(INDEX(base_indices,,1)=$A27),INDEX(base_indices,,),0)))","v":122.5},{"$f":"IF(A27>date,\"\",IF(OR(G$13=\"\",G$13=\"Fioul lourd\"),#N/A,SUM(IF((INDEX(base_indices,1,)=G$13)*(INDEX(base_indices,,1)=$A27),INDEX(base_indices,,),0))))","v":104.5},{"$f":"IF(A27>date,\"\",IF(OR(H$13=\"\",H$13=\"Fioul lourd\"),#N/A,SUM(IF((INDEX(base_indices,1,)=H$13)*(INDEX(base_indices,,1)=$A27),INDEX(base_indices,,),0))))","v":111.3}]
["2019-12-01",{"$f":"IF(A28>date,\"\",SUM(IF((INDEX(base_index,1,)=B$13)*(INDEX(base_index,,1)=$A28),INDEX(base_index,,),0)))","v":110.4},{"$f":"IF(A28>date,\"\",IF((SUM(IF((INDEX(base_index,1,)=C$13)*(INDEX(base_index,,1)=$A28),INDEX(base_index,,),0)))=0,#N/A,SUM(IF((INDEX(base_index,1,)=C$13)*(INDEX(base_index,,1)=$A28),INDEX(base_index,,),0))))","v":114.3},{"$f":"IF(A28>date,\"\",SUM(IF((INDEX(base_indices,1,)=D$13)*(INDEX(base_indices,,1)=$A28),INDEX(base_indices,,),0)))","v":104.6},{"$f":"IF(A28>date,\"\",SUM(IF((INDEX(base_indices,1,)=E$13)*(INDEX(base_indices,,1)=$A28),INDEX(base_indices,,),0)))","v":123.9},{"$f":"IF(A28>date,\"\",SUM(IF((INDEX(base_indices,1,)=F$13)*(INDEX(base_indices,,1)=$A28),INDEX(base_indices,,),0)))","v":124.1},{"$f":"IF(A28>date,\"\",IF(OR(G$13=\"\",G$13=\"Fioul lourd\"),#N/A,SUM(IF((INDEX(base_indices,1,)=G$13)*(INDEX(base_indices,,1)=$A28),INDEX(base_indices,,),0))))","v":104.8},{"$f":"IF(A28>date,\"\",IF(OR(H$13=\"\",H$13=\"Fioul lourd\"),#N/A,SUM(IF((INDEX(base_indices,1,)=H$13)*(INDEX(base_indices,,1)=$A28),INDEX(base_indices,,),0))))","v":111.2}]
["2020-01-01",{"$f":"IF(A29>date,\"\",SUM(IF((INDEX(base_index,1,)=B$13)*(INDEX(base_index,,1)=$A29),INDEX(base_index,,),0)))","v":111.4},{"$f":"IF(A29>date,\"\",IF((SUM(IF((INDEX(base_index,1,)=C$13)*(INDEX(base_index,,1)=$A29),INDEX(base_index,,),0)))=0,#N/A,SUM(IF((INDEX(base_index,1,)=C$13)*(INDEX(base_index,,1)=$A29),INDEX(base_index,,),0))))","v":114.7},{"$f":"IF(A29>date,\"\",SUM(IF((INDEX(base_indices,1,)=D$13)*(INDEX(base_indices,,1)=$A29),INDEX(base_indices,,),0)))","v":104.7},{"$f":"IF(A29>date,\"\",SUM(IF((INDEX(base_indices,1,)=E$13)*(INDEX(base_indices,,1)=$A29),INDEX(base_indices,,),0)))","v":123.7},{"$f":"IF(A29>date,\"\",SUM(IF((INDEX(base_indices,1,)=F$13)*(INDEX(base_indices,,1)=$A29),INDEX(base_indices,,),0)))","v":120.9},{"$f":"IF(A29>date,\"\",IF(OR(G$13=\"\",G$13=\"Fioul lourd\"),#N/A,SUM(IF((INDEX(base_indices,1,)=G$13)*(INDEX(base_indices,,1)=$A29),INDEX(base_indices,,),0))))","v":105.2},{"$f":"IF(A29>date,\"\",IF(OR(H$13=\"\",H$13=\"Fioul lourd\"),#N/A,SUM(IF((INDEX(base_indices,1,)=H$13)*(INDEX(base_indices,,1)=$A29),INDEX(base_indices,,),0))))","v":112.6}]
["2020-02-01",{"$f":"IF(A30>date,\"\",SUM(IF((INDEX(base_index,1,)=B$13)*(INDEX(base_index,,1)=$A30),INDEX(base_index,,),0)))","v":111.7},{"$f":"IF(A30>date,\"\",IF((SUM(IF((INDEX(base_index,1,)=C$13)*(INDEX(base_index,,1)=$A30),INDEX(base_index,,),0)))=0,#N/A,SUM(IF((INDEX(base_index,1,)=C$13)*(INDEX(base_index,,1)=$A30),INDEX(base_index,,),0))))","v":114.8},{"$f":"IF(A30>date,\"\",SUM(IF((INDEX(base_indices,1,)=D$13)*(INDEX(base_indices,,1)=$A30),INDEX(base_indices,,),0)))","v":105.5},{"$f":"IF(A30>date,\"\",SUM(IF((INDEX(base_indices,1,)=E$13)*(INDEX(base_indices,,1)=$A30),INDEX(base_indices,,),0)))","v":123.5},{"$f":"IF(A30>date,\"\",SUM(IF((INDEX(base_indices,1,)=F$13)*(INDEX(base_indices,,1)=$A30),INDEX(base_indices,,),0)))","v":115.3},{"$f":"IF(A30>date,\"\",IF(OR(G$13=\"\",G$13=\"Fioul lourd\"),#N/A,SUM(IF((INDEX(base_indices,1,)=G$13)*(INDEX(base_indices,,1)=$A30),INDEX(base_indices,,),0))))","v":103.7},{"$f":"IF(A30>date,\"\",IF(OR(H$13=\"\",H$13=\"Fioul lourd\"),#N/A,SUM(IF((INDEX(base_indices,1,)=H$13)*(INDEX(base_indices,,1)=$A30),INDEX(base_indices,,),0))))","v":113.5}]
["2020-03-01",{"$f":"IF(A31>date,\"\",SUM(IF((INDEX(base_index,1,)=B$13)*(INDEX(base_index,,1)=$A31),INDEX(base_index,,),0)))","v":110.8},{"$f":"IF(A31>date,\"\",IF((SUM(IF((INDEX(base_index,1,)=C$13)*(INDEX(base_index,,1)=$A31),INDEX(base_index,,),0)))=0,#N/A,SUM(IF((INDEX(base_index,1,)=C$13)*(INDEX(base_index,,1)=$A31),INDEX(base_index,,),0))))","v":114.7},{"$f":"IF(A31>date,\"\",SUM(IF((INDEX(base_indices,1,)=D$13)*(INDEX(base_indices,,1)=$A31),INDEX(base_indices,,),0)))","v":105.3},{"$f":"IF(A31>date,\"\",SUM(IF((INDEX(base_indices,1,)=E$13)*(INDEX(base_indices,,1)=$A31),INDEX(base_indices,,),0)))","v":123.3},{"$f":"IF(A31>date,\"\",SUM(IF((INDEX(base_indices,1,)=F$13)*(INDEX(base_indices,,1)=$A31),INDEX(base_indices,,),0)))","v":99.2},{"$f":"IF(A31>date,\"\",IF(OR(G$13=\"\",G$13=\"Fioul lourd\"),#N/A,SUM(IF((INDEX(base_indices,1,)=G$13)*(INDEX(base_indices,,1)=$A31),INDEX(base_indices,,),0))))","v":103.5},{"$f":"IF(A31>date,\"\",IF(OR(H$13=\"\",H$13=\"Fioul lourd\"),#N/A,SUM(IF((INDEX(base_indices,1,)=H$13)*(INDEX(base_indices,,1)=$A31),INDEX(base_indices,,),0))))","v":112.3}]
["2020-04-01",{"$f":"IF(A32>date,\"\",SUM(IF((INDEX(base_index,1,)=B$13)*(INDEX(base_index,,1)=$A32),INDEX(base_index,,),0)))","v":108.9},{"$f":"IF(A32>date,\"\",IF((SUM(IF((INDEX(base_index,1,)=C$13)*(INDEX(base_index,,1)=$A32),INDEX(base_index,,),0)))=0,#N/A,SUM(IF((INDEX(base_index,1,)=C$13)*(INDEX(base_index,,1)=$A32),INDEX(base_index,,),0))))","v":114.4},{"$f":"IF(A32>date,\"\",SUM(IF((INDEX(base_indices,1,)=D$13)*(INDEX(base_indices,,1)=$A32),INDEX(base_indices,,),0)))","v":105.5},{"$f":"IF(A32>date,\"\",SUM(IF((INDEX(base_indices,1,)=E$13)*(INDEX(base_indices,,1)=$A32),INDEX(base_indices,,),0)))","v":123.6},{"$f":"IF(A32>date,\"\",SUM(IF((INDEX(base_indices,1,)=F$13)*(INDEX(base_indices,,1)=$A32),INDEX(base_indices,,),0)))","v":88.2},{"$f":"IF(A32>date,\"\",IF(OR(G$13=\"\",G$13=\"Fioul lourd\"),#N/A,SUM(IF((INDEX(base_indices,1,)=G$13)*(INDEX(base_indices,,1)=$A32),INDEX(base_indices,,),0))))","v":102.7},{"$f":"IF(A32>date,\"\",IF(OR(H$13=\"\",H$13=\"Fioul lourd\"),#N/A,SUM(IF((INDEX(base_indices,1,)=H$13)*(INDEX(base_indices,,1)=$A32),INDEX(base_indices,,),0))))","v":112.1}]
["2020-05-01",{"$f":"IF(A33>date,\"\",SUM(IF((INDEX(base_index,1,)=B$13)*(INDEX(base_index,,1)=$A33),INDEX(base_index,,),0)))","v":108.7},{"$f":"IF(A33>date,\"\",IF((SUM(IF((INDEX(base_index,1,)=C$13)*(INDEX(base_index,,1)=$A33),INDEX(base_index,,),0)))=0,#N/A,SUM(IF((INDEX(base_index,1,)=C$13)*(INDEX(base_index,,1)=$A33),INDEX(base_index,,),0))))","v":114.2},{"$f":"IF(A33>date,\"\",SUM(IF((INDEX(base_indices,1,)=D$13)*(INDEX(base_indices,,1)=$A33),INDEX(base_indices,,),0)))","v":104.9},{"$f":"IF(A33>date,\"\",SUM(IF((INDEX(base_indices,1,)=E$13)*(INDEX(base_indices,,1)=$A33),INDEX(base_indices,,),0)))","v":123.8},{"$f":"IF(A33>date,\"\",SUM(IF((INDEX(base_indices,1,)=F$13)*(INDEX(base_indices,,1)=$A33),INDEX(base_indices,,),0)))","v":91.2},{"$f":"IF(A33>date,\"\",IF(OR(G$13=\"\",G$13=\"Fioul lourd\"),#N/A,SUM(IF((INDEX(base_indices,1,)=G$13)*(INDEX(base_indices,,1)=$A33),INDEX(base_indices,,),0))))","v":104.4},{"$f":"IF(A33>date,\"\",IF(OR(H$13=\"\",H$13=\"Fioul lourd\"),#N/A,SUM(IF((INDEX(base_indices,1,)=H$13)*(INDEX(base_indices,,1)=$A33),INDEX(base_indices,,),0))))","v":111.3}]
["2020-06-01",{"$f":"IF(A34>date,\"\",SUM(IF((INDEX(base_index,1,)=B$13)*(INDEX(base_index,,1)=$A34),INDEX(base_index,,),0)))","v":108.8},{"$f":"IF(A34>date,\"\",IF((SUM(IF((INDEX(base_index,1,)=C$13)*(INDEX(base_index,,1)=$A34),INDEX(base_index,,),0)))=0,#N/A,SUM(IF((INDEX(base_index,1,)=C$13)*(INDEX(base_index,,1)=$A34),INDEX(base_index,,),0))))","v":113.7},{"$f":"IF(A34>date,\"\",SUM(IF((INDEX(base_indices,1,)=D$13)*(INDEX(base_indices,,1)=$A34),INDEX(base_indices,,),0)))","v":103},{"$f":"IF(A34>date,\"\",SUM(IF((INDEX(base_indices,1,)=E$13)*(INDEX(base_indices,,1)=$A34),INDEX(base_indices,,),0)))","v":124},{"$f":"IF(A34>date,\"\",SUM(IF((INDEX(base_indices,1,)=F$13)*(INDEX(base_indices,,1)=$A34),INDEX(base_indices,,),0)))","v":97.2},{"$f":"IF(A34>date,\"\",IF(OR(G$13=\"\",G$13=\"Fioul lourd\"),#N/A,SUM(IF((INDEX(base_indices,1,)=G$13)*(INDEX(base_indices,,1)=$A34),INDEX(base_indices,,),0))))","v":105.4},{"$f":"IF(A34>date,\"\",IF(OR(H$13=\"\",H$13=\"Fioul lourd\"),#N/A,SUM(IF((INDEX(base_indices,1,)=H$13)*(INDEX(base_indices,,1)=$A34),INDEX(base_indices,,),0))))","v":109.7}]
["2020-07-01",{"$f":"IF(A35>date,\"\",SUM(IF((INDEX(base_index,1,)=B$13)*(INDEX(base_index,,1)=$A35),INDEX(base_index,,),0)))","v":109.9},{"$f":"IF(A35>date,\"\",IF((SUM(IF((INDEX(base_index,1,)=C$13)*(INDEX(base_index,,1)=$A35),INDEX(base_index,,),0)))=0,#N/A,SUM(IF((INDEX(base_index,1,)=C$13)*(INDEX(base_index,,1)=$A35),INDEX(base_index,,),0))))","v":113.7},{"$f":"IF(A35>date,\"\",SUM(IF((INDEX(base_indices,1,)=D$13)*(INDEX(base_indices,,1)=$A35),INDEX(base_indices,,),0)))","v":102.6},{"$f":"IF(A35>date,\"\",SUM(IF((INDEX(base_indices,1,)=E$13)*(INDEX(base_indices,,1)=$A35),INDEX(base_indices,,),0)))","v":123.8},{"$f":"IF(A35>date,\"\",SUM(IF((INDEX(base_indices,1,)=F$13)*(INDEX(base_indices,,1)=$A35),INDEX(base_indices,,),0)))","v":99.7},{"$f":"IF(A35>date,\"\",IF(OR(G$13=\"\",G$13=\"Fioul lourd\"),#N/A,SUM(IF((INDEX(base_indices,1,)=G$13)*(INDEX(base_indices,,1)=$A35),INDEX(base_indices,,),0))))","v":105.6},{"$f":"IF(A35>date,\"\",IF(OR(H$13=\"\",H$13=\"Fioul lourd\"),#N/A,SUM(IF((INDEX(base_indices,1,)=H$13)*(INDEX(base_indices,,1)=$A35),INDEX(base_indices,,),0))))","v":108}]
["2020-08-01",{"$f":"IF(A36>date,\"\",SUM(IF((INDEX(base_index,1,)=B$13)*(INDEX(base_index,,1)=$A36),INDEX(base_index,,),0)))","v":110},{"$f":"IF(A36>date,\"\",IF((SUM(IF((INDEX(base_index,1,)=C$13)*(INDEX(base_index,,1)=$A36),INDEX(base_index,,),0)))=0,#N/A,SUM(IF((INDEX(base_index,1,)=C$13)*(INDEX(base_index,,1)=$A36),INDEX(base_index,,),0))))","v":113.8},{"$f":"IF(A36>date,\"\",SUM(IF((INDEX(base_indices,1,)=D$13)*(INDEX(base_indices,,1)=$A36),INDEX(base_indices,,),0)))","v":102.8},{"$f":"IF(A36>date,\"\",SUM(IF((INDEX(base_indices,1,)=E$13)*(INDEX(base_indices,,1)=$A36),INDEX(base_indices,,),0)))","v":123.7},{"$f":"IF(A36>date,\"\",SUM(IF((INDEX(base_indices,1,)=F$13)*(INDEX(base_indices,,1)=$A36),INDEX(base_indices,,),0)))","v":98.3},{"$f":"IF(A36>date,\"\",IF(OR(G$13=\"\",G$13=\"Fioul lourd\"),#N/A,SUM(IF((INDEX(base_indices,1,)=G$13)*(INDEX(base_indices,,1)=$A36),INDEX(base_indices,,),0))))","v":105.4},{"$f":"IF(A36>date,\"\",IF(OR(H$13=\"\",H$13=\"Fioul lourd\"),#N/A,SUM(IF((INDEX(base_indices,1,)=H$13)*(INDEX(base_indices,,1)=$A36),INDEX(base_indices,,),0))))","v":107.4}]
["2020-09-01",{"$f":"IF(A37>date,\"\",SUM(IF((INDEX(base_index,1,)=B$13)*(INDEX(base_index,,1)=$A37),INDEX(base_index,,),0)))","v":110.1},{"$f":"IF(A37>date,\"\",IF((SUM(IF((INDEX(base_index,1,)=C$13)*(INDEX(base_index,,1)=$A37),INDEX(base_index,,),0)))=0,#N/A,SUM(IF((INDEX(base_index,1,)=C$13)*(INDEX(base_index,,1)=$A37),INDEX(base_index,,),0))))","v":114.4},{"$f":"IF(A37>date,\"\",SUM(IF((INDEX(base_indices,1,)=D$13)*(INDEX(base_indices,,1)=$A37),INDEX(base_indices,,),0)))","v":104.4},{"$f":"IF(A37>date,\"\",SUM(IF((INDEX(base_indices,1,)=E$13)*(INDEX(base_indices,,1)=$A37),INDEX(base_indices,,),0)))","v":123.6},{"$f":"IF(A37>date,\"\",SUM(IF((INDEX(base_indices,1,)=F$13)*(INDEX(base_indices,,1)=$A37),INDEX(base_indices,,),0)))","v":94.9},{"$f":"IF(A37>date,\"\",IF(OR(G$13=\"\",G$13=\"Fioul lourd\"),#N/A,SUM(IF((INDEX(base_indices,1,)=G$13)*(INDEX(base_indices,,1)=$A37),INDEX(base_indices,,),0))))","v":106.5},{"$f":"IF(A37>date,\"\",IF(OR(H$13=\"\",H$13=\"Fioul lourd\"),#N/A,SUM(IF((INDEX(base_indices,1,)=H$13)*(INDEX(base_indices,,1)=$A37),INDEX(base_indices,,),0))))","v":108.5}]
["2020-10-01",{"$f":"IF(A38>date,\"\",SUM(IF((INDEX(base_index,1,)=B$13)*(INDEX(base_index,,1)=$A38),INDEX(base_index,,),0)))","v":109.5},{"$f":"IF(A38>date,\"\",IF((SUM(IF((INDEX(base_index,1,)=C$13)*(INDEX(base_index,,1)=$A38),INDEX(base_index,,),0)))=0,#N/A,SUM(IF((INDEX(base_index,1,)=C$13)*(INDEX(base_index,,1)=$A38),INDEX(base_index,,),0))))","v":114.4},{"$f":"IF(A38>date,\"\",SUM(IF((INDEX(base_indices,1,)=D$13)*(INDEX(base_indices,,1)=$A38),INDEX(base_indices,,),0)))","v":104.1},{"$f":"IF(A38>date,\"\",SUM(IF((INDEX(base_indices,1,)=E$13)*(INDEX(base_indices,,1)=$A38),INDEX(base_indices,,),0)))","v":123.5},{"$f":"IF(A38>date,\"\",SUM(IF((INDEX(base_indices,1,)=F$13)*(INDEX(base_indices,,1)=$A38),INDEX(base_indices,,),0)))","v":95},{"$f":"IF(A38>date,\"\",IF(OR(G$13=\"\",G$13=\"Fioul lourd\"),#N/A,SUM(IF((INDEX(base_indices,1,)=G$13)*(INDEX(base_indices,,1)=$A38),INDEX(base_indices,,),0))))","v":105.9},{"$f":"IF(A38>date,\"\",IF(OR(H$13=\"\",H$13=\"Fioul lourd\"),#N/A,SUM(IF((INDEX(base_indices,1,)=H$13)*(INDEX(base_indices,,1)=$A38),INDEX(base_indices,,),0))))","v":110.7}]
["2020-11-01",{"$f":"IF(A39>date,\"\",SUM(IF((INDEX(base_index,1,)=B$13)*(INDEX(base_index,,1)=$A39),INDEX(base_index,,),0)))","v":109.5},{"$f":"IF(A39>date,\"\",IF((SUM(IF((INDEX(base_index,1,)=C$13)*(INDEX(base_index,,1)=$A39),INDEX(base_index,,),0)))=0,#N/A,SUM(IF((INDEX(base_index,1,)=C$13)*(INDEX(base_index,,1)=$A39),INDEX(base_index,,),0))))","v":114.5},{"$f":"IF(A39>date,\"\",SUM(IF((INDEX(base_indices,1,)=D$13)*(INDEX(base_indices,,1)=$A39),INDEX(base_indices,,),0)))","v":104.4},{"$f":"IF(A39>date,\"\",SUM(IF((INDEX(base_indices,1,)=E$13)*(INDEX(base_indices,,1)=$A39),INDEX(base_indices,,),0)))","v":123.5},{"$f":"IF(A39>date,\"\",SUM(IF((INDEX(base_indices,1,)=F$13)*(INDEX(base_indices,,1)=$A39),INDEX(base_indices,,),0)))","v":96.6},{"$f":"IF(A39>date,\"\",IF(OR(G$13=\"\",G$13=\"Fioul lourd\"),#N/A,SUM(IF((INDEX(base_indices,1,)=G$13)*(INDEX(base_indices,,1)=$A39),INDEX(base_indices,,),0))))","v":105.4},{"$f":"IF(A39>date,\"\",IF(OR(H$13=\"\",H$13=\"Fioul lourd\"),#N/A,SUM(IF((INDEX(base_indices,1,)=H$13)*(INDEX(base_indices,,1)=$A39),INDEX(base_indices,,),0))))","v":112.6}]
["2020-12-01",{"$f":"IF(A40>date,\"\",SUM(IF((INDEX(base_index,1,)=B$13)*(INDEX(base_index,,1)=$A40),INDEX(base_index,,),0)))","v":109.8},{"$f":"IF(A40>date,\"\",IF((SUM(IF((INDEX(base_index,1,)=C$13)*(INDEX(base_index,,1)=$A40),INDEX(base_index,,),0)))=0,#N/A,SUM(IF((INDEX(base_index,1,)=C$13)*(INDEX(base_index,,1)=$A40),INDEX(base_index,,),0))))","v":114.9},{"$f":"IF(A40>date,\"\",SUM(IF((INDEX(base_indices,1,)=D$13)*(INDEX(base_indices,,1)=$A40),INDEX(base_indices,,),0)))","v":104.4},{"$f":"IF(A40>date,\"\",SUM(IF((INDEX(base_indices,1,)=E$13)*(INDEX(base_indices,,1)=$A40),INDEX(base_indices,,),0)))","v":123.4},{"$f":"IF(A40>date,\"\",SUM(IF((INDEX(base_indices,1,)=F$13)*(INDEX(base_indices,,1)=$A40),INDEX(base_indices,,),0)))","v":101.2},{"$f":"IF(A40>date,\"\",IF(OR(G$13=\"\",G$13=\"Fioul lourd\"),#N/A,SUM(IF((INDEX(base_indices,1,)=G$13)*(INDEX(base_indices,,1)=$A40),INDEX(base_indices,,),0))))","v":104.7},{"$f":"IF(A40>date,\"\",IF(OR(H$13=\"\",H$13=\"Fioul lourd\"),#N/A,SUM(IF((INDEX(base_indices,1,)=H$13)*(INDEX(base_indices,,1)=$A40),INDEX(base_indices,,),0))))","v":116.1}]
["2021-01-01",{"$f":"IF(A41>date,\"\",SUM(IF((INDEX(base_index,1,)=B$13)*(INDEX(base_index,,1)=$A41),INDEX(base_index,,),0)))","v":111.2},{"$f":"IF(A41>date,\"\",IF((SUM(IF((INDEX(base_index,1,)=C$13)*(INDEX(base_index,,1)=$A41),INDEX(base_index,,),0)))=0,#N/A,SUM(IF((INDEX(base_index,1,)=C$13)*(INDEX(base_index,,1)=$A41),INDEX(base_index,,),0))))","v":116.3},{"$f":"IF(A41>date,\"\",SUM(IF((INDEX(base_indices,1,)=D$13)*(INDEX(base_indices,,1)=$A41),INDEX(base_indices,,),0)))","v":104.5},{"$f":"IF(A41>date,\"\",SUM(IF((INDEX(base_indices,1,)=E$13)*(INDEX(base_indices,,1)=$A41),INDEX(base_indices,,),0)))","v":123.4},{"$f":"IF(A41>date,\"\",SUM(IF((INDEX(base_indices,1,)=F$13)*(INDEX(base_indices,,1)=$A41),INDEX(base_indices,,),0)))","v":104.6},{"$f":"IF(A41>date,\"\",IF(OR(G$13=\"\",G$13=\"Fioul lourd\"),#N/A,SUM(IF((INDEX(base_indices,1,)=G$13)*(INDEX(base_indices,,1)=$A41),INDEX(base_indices,,),0))))","v":105.8},{"$f":"IF(A41>date,\"\",IF(OR(H$13=\"\",H$13=\"Fioul lourd\"),#N/A,SUM(IF((INDEX(base_indices,1,)=H$13)*(INDEX(base_indices,,1)=$A41),INDEX(base_indices,,),0))))","v":130.80000000000001}]
["2021-02-01",{"$f":"IF(A42>date,\"\",SUM(IF((INDEX(base_index,1,)=B$13)*(INDEX(base_index,,1)=$A42),INDEX(base_index,,),0)))","v":112.1},{"$f":"IF(A42>date,\"\",IF((SUM(IF((INDEX(base_index,1,)=C$13)*(INDEX(base_index,,1)=$A42),INDEX(base_index,,),0)))=0,#N/A,SUM(IF((INDEX(base_index,1,)=C$13)*(INDEX(base_index,,1)=$A42),INDEX(base_index,,),0))))","v":117.2},{"$f":"IF(A42>date,\"\",SUM(IF((INDEX(base_indices,1,)=D$13)*(INDEX(base_indices,,1)=$A42),INDEX(base_indices,,),0)))","v":104.5},{"$f":"IF(A42>date,\"\",SUM(IF((INDEX(base_indices,1,)=E$13)*(INDEX(base_indices,,1)=$A42),INDEX(base_indices,,),0)))","v":123.3},{"$f":"IF(A42>date,\"\",SUM(IF((INDEX(base_indices,1,)=F$13)*(INDEX(base_indices,,1)=$A42),INDEX(base_indices,,),0)))","v":109.6},{"$f":"IF(A42>date,\"\",IF(OR(G$13=\"\",G$13=\"Fioul lourd\"),#N/A,SUM(IF((INDEX(base_indices,1,)=G$13)*(INDEX(base_indices,,1)=$A42),INDEX(base_indices,,),0))))","v":105.9},{"$f":"IF(A42>date,\"\",IF(OR(H$13=\"\",H$13=\"Fioul lourd\"),#N/A,SUM(IF((INDEX(base_indices,1,)=H$13)*(INDEX(base_indices,,1)=$A42),INDEX(base_indices,,),0))))","v":139.19999999999999}]
["2021-03-01",{"$f":"IF(A43>date,\"\",SUM(IF((INDEX(base_index,1,)=B$13)*(INDEX(base_index,,1)=$A43),INDEX(base_index,,),0)))","v":113.5},{"$f":"IF(A43>date,\"\",IF((SUM(IF((INDEX(base_index,1,)=C$13)*(INDEX(base_index,,1)=$A43),INDEX(base_index,,),0)))=0,#N/A,SUM(IF((INDEX(base_index,1,)=C$13)*(INDEX(base_index,,1)=$A43),INDEX(base_index,,),0))))","v":118.3},{"$f":"IF(A43>date,\"\",SUM(IF((INDEX(base_indices,1,)=D$13)*(INDEX(base_indices,,1)=$A43),INDEX(base_indices,,),0)))","v":107.6},{"$f":"IF(A43>date,\"\",SUM(IF((INDEX(base_indices,1,)=E$13)*(INDEX(base_indices,,1)=$A43),INDEX(base_indices,,),0)))","v":123.3},{"$f":"IF(A43>date,\"\",SUM(IF((INDEX(base_indices,1,)=F$13)*(INDEX(base_indices,,1)=$A43),INDEX(base_indices,,),0)))","v":111.5},{"$f":"IF(A43>date,\"\",IF(OR(G$13=\"\",G$13=\"Fioul lourd\"),#N/A,SUM(IF((INDEX(base_indices,1,)=G$13)*(INDEX(base_indices,,1)=$A43),INDEX(base_indices,,),0))))","v":106.2},{"$f":"IF(A43>date,\"\",IF(OR(H$13=\"\",H$13=\"Fioul lourd\"),#N/A,SUM(IF((INDEX(base_indices,1,)=H$13)*(INDEX(base_indices,,1)=$A43),INDEX(base_indices,,),0))))","v":144.6}]
["2021-04-01",{"$f":"IF(A44>date,\"\",SUM(IF((INDEX(base_index,1,)=B$13)*(INDEX(base_index,,1)=$A44),INDEX(base_index,,),0)))","v":113.8},{"$f":"IF(A44>date,\"\",IF((SUM(IF((INDEX(base_index,1,)=C$13)*(INDEX(base_index,,1)=$A44),INDEX(base_index,,),0)))=0,#N/A,SUM(IF((INDEX(base_index,1,)=C$13)*(INDEX(base_index,,1)=$A44),INDEX(base_index,,),0))))","v":118.9},{"$f":"IF(A44>date,\"\",SUM(IF((INDEX(base_indices,1,)=D$13)*(INDEX(base_indices,,1)=$A44),INDEX(base_indices,,),0)))","v":107.8},{"$f":"IF(A44>date,\"\",SUM(IF((INDEX(base_indices,1,)=E$13)*(INDEX(base_indices,,1)=$A44),INDEX(base_indices,,),0)))","v":123},{"$f":"IF(A44>date,\"\",SUM(IF((INDEX(base_indices,1,)=F$13)*(INDEX(base_indices,,1)=$A44),INDEX(base_indices,,),0)))","v":110.9},{"$f":"IF(A44>date,\"\",IF(OR(G$13=\"\",G$13=\"Fioul lourd\"),#N/A,SUM(IF((INDEX(base_indices,1,)=G$13)*(INDEX(base_indices,,1)=$A44),INDEX(base_indices,,),0))))","v":106.4},{"$f":"IF(A44>date,\"\",IF(OR(H$13=\"\",H$13=\"Fioul lourd\"),#N/A,SUM(IF((INDEX(base_indices,1,)=H$13)*(INDEX(base_indices,,1)=$A44),INDEX(base_indices,,),0))))","v":149.4}]
["2021-05-01",{"$f":"IF(A45>date,\"\",SUM(IF((INDEX(base_index,1,)=B$13)*(INDEX(base_index,,1)=$A45),INDEX(base_index,,),0)))","v":114},{"$f":"IF(A45>date,\"\",IF((SUM(IF((INDEX(base_index,1,)=C$13)*(INDEX(base_index,,1)=$A45),INDEX(base_index,,),0)))=0,#N/A,SUM(IF((INDEX(base_index,1,)=C$13)*(INDEX(base_index,,1)=$A45),INDEX(base_index,,),0))))","v":119},{"$f":"IF(A45>date,\"\",SUM(IF((INDEX(base_indices,1,)=D$13)*(INDEX(base_indices,,1)=$A45),INDEX(base_indices,,),0)))","v":107.2},{"$f":"IF(A45>date,\"\",SUM(IF((INDEX(base_indices,1,)=E$13)*(INDEX(base_indices,,1)=$A45),INDEX(base_indices,,),0)))","v":122.7},{"$f":"IF(A45>date,\"\",SUM(IF((INDEX(base_indices,1,)=F$13)*(INDEX(base_indices,,1)=$A45),INDEX(base_indices,,),0)))","v":112.9},{"$f":"IF(A45>date,\"\",IF(OR(G$13=\"\",G$13=\"Fioul lourd\"),#N/A,SUM(IF((INDEX(base_indices,1,)=G$13)*(INDEX(base_indices,,1)=$A45),INDEX(base_indices,,),0))))","v":106},{"$f":"IF(A45>date,\"\",IF(OR(H$13=\"\",H$13=\"Fioul lourd\"),#N/A,SUM(IF((INDEX(base_indices,1,)=H$13)*(INDEX(base_indices,,1)=$A45),INDEX(base_indices,,),0))))","v":153.5}]
["2021-06-01",{"$f":"IF(A46>date,\"\",SUM(IF((INDEX(base_index,1,)=B$13)*(INDEX(base_index,,1)=$A46),INDEX(base_index,,),0)))","v":114.8},{"$f":"IF(A46>date,\"\",IF((SUM(IF((INDEX(base_index,1,)=C$13)*(INDEX(base_index,,1)=$A46),INDEX(base_index,,),0)))=0,#N/A,SUM(IF((INDEX(base_index,1,)=C$13)*(INDEX(base_index,,1)=$A46),INDEX(base_index,,),0))))","v":120.8},{"$f":"IF(A46>date,\"\",SUM(IF((INDEX(base_indices,1,)=D$13)*(INDEX(base_indices,,1)=$A46),INDEX(base_indices,,),0)))","v":107.8},{"$f":"IF(A46>date,\"\",SUM(IF((INDEX(base_indices,1,)=E$13)*(INDEX(base_indices,,1)=$A46),INDEX(base_indices,,),0)))","v":122.5},{"$f":"IF(A46>date,\"\",SUM(IF((INDEX(base_indices,1,)=F$13)*(INDEX(base_indices,,1)=$A46),INDEX(base_indices,,),0)))","v":117.1},{"$f":"IF(A46>date,\"\",IF(OR(G$13=\"\",G$13=\"Fioul lourd\"),#N/A,SUM(IF((INDEX(base_indices,1,)=G$13)*(INDEX(base_indices,,1)=$A46),INDEX(base_indices,,),0))))","v":105.6},{"$f":"IF(A46>date,\"\",IF(OR(H$13=\"\",H$13=\"Fioul lourd\"),#N/A,SUM(IF((INDEX(base_indices,1,)=H$13)*(INDEX(base_indices,,1)=$A46),INDEX(base_indices,,),0))))","v":167.7}]
["2021-07-01",{"$f":"IF(A47>date,\"\",SUM(IF((INDEX(base_index,1,)=B$13)*(INDEX(base_index,,1)=$A47),INDEX(base_index,,),0)))","v":115.9},{"$f":"IF(A47>date,\"\",IF((SUM(IF((INDEX(base_index,1,)=C$13)*(INDEX(base_index,,1)=$A47),INDEX(base_index,,),0)))=0,#N/A,SUM(IF((INDEX(base_index,1,)=C$13)*(INDEX(base_index,,1)=$A47),INDEX(base_index,,),0))))","v":122.7},{"$f":"IF(A47>date,\"\",SUM(IF((INDEX(base_indices,1,)=D$13)*(INDEX(base_indices,,1)=$A47),INDEX(base_indices,,),0)))","v":108.3},{"$f":"IF(A47>date,\"\",SUM(IF((INDEX(base_indices,1,)=E$13)*(INDEX(base_indices,,1)=$A47),INDEX(base_indices,,),0)))","v":122.5},{"$f":"IF(A47>date,\"\",SUM(IF((INDEX(base_indices,1,)=F$13)*(INDEX(base_indices,,1)=$A47),INDEX(base_indices,,),0)))","v":120.9},{"$f":"IF(A47>date,\"\",IF(OR(G$13=\"\",G$13=\"Fioul lourd\"),#N/A,SUM(IF((INDEX(base_indices,1,)=G$13)*(INDEX(base_indices,,1)=$A47),INDEX(base_indices,,),0))))","v":106.7},{"$f":"IF(A47>date,\"\",IF(OR(H$13=\"\",H$13=\"Fioul lourd\"),#N/A,SUM(IF((INDEX(base_indices,1,)=H$13)*(INDEX(base_indices,,1)=$A47),INDEX(base_indices,,),0))))","v":185.7}]
["2021-08-01",{"$f":"IF(A48>date,\"\",SUM(IF((INDEX(base_index,1,)=B$13)*(INDEX(base_index,,1)=$A48),INDEX(base_index,,),0)))","v":116.1},{"$f":"IF(A48>date,\"\",IF((SUM(IF((INDEX(base_index,1,)=C$13)*(INDEX(base_index,,1)=$A48),INDEX(base_index,,),0)))=0,#N/A,SUM(IF((INDEX(base_index,1,)=C$13)*(INDEX(base_index,,1)=$A48),INDEX(base_index,,),0))))","v":123.1},{"$f":"IF(A48>date,\"\",SUM(IF((INDEX(base_indices,1,)=D$13)*(INDEX(base_indices,,1)=$A48),INDEX(base_indices,,),0)))","v":108.2},{"$f":"IF(A48>date,\"\",SUM(IF((INDEX(base_indices,1,)=E$13)*(INDEX(base_indices,,1)=$A48),INDEX(base_indices,,),0)))","v":122.6},{"$f":"IF(A48>date,\"\",SUM(IF((INDEX(base_indices,1,)=F$13)*(INDEX(base_indices,,1)=$A48),INDEX(base_indices,,),0)))","v":122.5},{"$f":"IF(A48>date,\"\",IF(OR(G$13=\"\",G$13=\"Fioul lourd\"),#N/A,SUM(IF((INDEX(base_indices,1,)=G$13)*(INDEX(base_indices,,1)=$A48),INDEX(base_indices,,),0))))","v":108.3},{"$f":"IF(A48>date,\"\",IF(OR(H$13=\"\",H$13=\"Fioul lourd\"),#N/A,SUM(IF((INDEX(base_indices,1,)=H$13)*(INDEX(base_indices,,1)=$A48),INDEX(base_indices,,),0))))","v":191.7}]
["2021-09-01",{"$f":"IF(A49>date,\"\",SUM(IF((INDEX(base_index,1,)=B$13)*(INDEX(base_index,,1)=$A49),INDEX(base_index,,),0)))","v":116.4},{"$f":"IF(A49>date,\"\",IF((SUM(IF((INDEX(base_index,1,)=C$13)*(INDEX(base_index,,1)=$A49),INDEX(base_index,,),0)))=0,#N/A,SUM(IF((INDEX(base_index,1,)=C$13)*(INDEX(base_index,,1)=$A49),INDEX(base_index,,),0))))","v":123.7},{"$f":"IF(A49>date,\"\",SUM(IF((INDEX(base_indices,1,)=D$13)*(INDEX(base_indices,,1)=$A49),INDEX(base_indices,,),0)))","v":108.6},{"$f":"IF(A49>date,\"\",SUM(IF((INDEX(base_indices,1,)=E$13)*(INDEX(base_indices,,1)=$A49),INDEX(base_indices,,),0)))","v":122.7},{"$f":"IF(A49>date,\"\",SUM(IF((INDEX(base_indices,1,)=F$13)*(INDEX(base_indices,,1)=$A49),INDEX(base_indices,,),0)))","v":123.3},{"$f":"IF(A49>date,\"\",IF(OR(G$13=\"\",G$13=\"Fioul lourd\"),#N/A,SUM(IF((INDEX(base_indices,1,)=G$13)*(INDEX(base_indices,,1)=$A49),INDEX(base_indices,,),0))))","v":105.5},{"$f":"IF(A49>date,\"\",IF(OR(H$13=\"\",H$13=\"Fioul lourd\"),#N/A,SUM(IF((INDEX(base_indices,1,)=H$13)*(INDEX(base_indices,,1)=$A49),INDEX(base_indices,,),0))))","v":196.7}]
["2021-10-01",{"$f":"IF(A50>date,\"\",SUM(IF((INDEX(base_index,1,)=B$13)*(INDEX(base_index,,1)=$A50),INDEX(base_index,,),0)))","v":117.5},{"$f":"IF(A50>date,\"\",IF((SUM(IF((INDEX(base_index,1,)=C$13)*(INDEX(base_index,,1)=$A50),INDEX(base_index,,),0)))=0,#N/A,SUM(IF((INDEX(base_index,1,)=C$13)*(INDEX(base_index,,1)=$A50),INDEX(base_index,,),0))))","v":123.6},{"$f":"IF(A50>date,\"\",SUM(IF((INDEX(base_indices,1,)=D$13)*(INDEX(base_indices,,1)=$A50),INDEX(base_indices,,),0)))","v":109},{"$f":"IF(A50>date,\"\",SUM(IF((INDEX(base_indices,1,)=E$13)*(INDEX(base_indices,,1)=$A50),INDEX(base_indices,,),0)))","v":122.7},{"$f":"IF(A50>date,\"\",SUM(IF((INDEX(base_indices,1,)=F$13)*(INDEX(base_indices,,1)=$A50),INDEX(base_indices,,),0)))","v":133},{"$f":"IF(A50>date,\"\",IF(OR(G$13=\"\",G$13=\"Fioul lourd\"),#N/A,SUM(IF((INDEX(base_indices,1,)=G$13)*(INDEX(base_indices,,1)=$A50),INDEX(base_indices,,),0))))","v":106.4},{"$f":"IF(A50>date,\"\",IF(OR(H$13=\"\",H$13=\"Fioul lourd\"),#N/A,SUM(IF((INDEX(base_indices,1,)=H$13)*(INDEX(base_indices,,1)=$A50),INDEX(base_indices,,),0))))","v":193}]
[]
[{"$f":"'Résultats depuis janvier'!B4","v":"TP02"}]
[]
[{"$f":"OFFSET('Composition index'!$J$2,0,I54)","v":"Travail activités spécialisées"},{"$f":"SUM(IF((INDEX(compo,2,)='Données cumul depuis janvier'!A54)*(INDEX(compo,,1)=$A$52),INDEX(compo,,),0))","v":0},{"$f":"_xlfn._xlws.SORT(A54:B88,2,-1)","v":"Béton prêt à l'emploi"},0.12,{"$f":"HLOOKUP(C54,'Composition index'!$A$2:$AR$3,2,FALSE)","v":"010534646"},{"$f":"SUM(IF((INDEX(base_indices,1,)=E54)*(INDEX(base_indices,,1)>='Données cumul depuis janvier'!$B$1)*(INDEX(base_indices,,1)<='Données cumul depuis janvier'!$C$1),INDEX(base_indices,,),0))/SUM(IF((INDEX(base_indices,1,)=E54)*(INDEX(base_indices,,1)>='Données cumul depuis janvier'!$D$1)*(INDEX(base_indices,,1)<='Données cumul depuis janvier'!$E$1),INDEX(base_indices,,),0))-1","v":1.3541865344268489E-2},{"$f":"SUM(IF((INDEX(base_indices,1,)=E54)*(INDEX(base_indices,,1)>=$B$3)*(INDEX(base_indices,,1)<=$C$3),INDEX(base_indices,,),0))/SUM(IF((INDEX(base_indices,1,)=E54)*(INDEX(base_indices,,1)>=$D$3)*(INDEX(base_indices,,1)<=$E$3),INDEX(base_indices,,),0))-1","v":1.383191834398545E-2},{"$f":"INDEX('Indice prix'!$B$1:$AP$2,1,MATCH('Données cumul depuis janvier'!E54,'Indice prix'!$B$2:$AP$2,0))","v":"base 2015"},null,{"$f":"IF(D54=0,\"\",\"base 100 en \"&RIGHT(H54,4))","v":"base 100 en 2015"},{"$f":"SUM(IF((INDEX(base_indices,1,)=E54)*(INDEX(base_indices,,1)='Indice prix'!A$59),INDEX(base_indices,,),0))","v":0}]
[{"$f":"OFFSET('Composition index'!$J$2,0,I55)","v":"Électricité vendue aux entreprises consommatrices finales"},{"$f":"SUM(IF((INDEX(compo,2,)='Données cumul depuis janvier'!A55)*(INDEX(compo,,1)=$A$52),INDEX(compo,,),0))","v":0.01},"Barres crénelées ou nervurées pour béton armé",0.09,{"$f":"HLOOKUP(C55,'Composition index'!$A$2:$AR$3,2,FALSE)","v":"010546545"},{"$f":"SUM(IF((INDEX(base_indices,1,)=E55)*(INDEX(base_indices,,1)>='Données cumul depuis janvier'!$B$1)*(INDEX(base_indices,,1)<='Données cumul depuis janvier'!$C$1),INDEX(base_indices,,),0))/SUM(IF((INDEX(base_indices,1,)=E55)*(INDEX(base_indices,,1)>='Données cumul depuis janvier'!$D$1)*(INDEX(base_indices,,1)<='Données cumul depuis janvier'!$E$1),INDEX(base_indices,,),0))-1","v":0.36126215191959177},{"$f":"SUM(IF((INDEX(base_indices,1,)=E55)*(INDEX(base_indices,,1)>=$B$3)*(INDEX(base_indices,,1)<=$C$3),INDEX(base_indices,,),0))/SUM(IF((INDEX(base_indices,1,)=E55)*(INDEX(base_indices,,1)>=$D$3)*(INDEX(base_indices,,1)<=$E$3),INDEX(base_indices,,),0))-1","v":0.49380706988518241},{"$f":"INDEX('Indice prix'!$B$1:$AP$2,1,MATCH('Données cumul depuis janvier'!E55,'Indice prix'!$B$2:$AP$2,0))","v":"base 2015"},1,{"$f":"IF(D55=0,\"\",\"base 100 en \"&RIGHT(H55,4))","v":"base 100 en 2015"},{"$f":"SUM(IF((INDEX(base_indices,1,)=E55)*(INDEX(base_indices,,1)='Indice prix'!A$59),INDEX(base_indices,,),0))","v":0}]
[{"$f":"OFFSET('Composition index'!$J$2,0,I56)","v":"Fioul lourd"},{"$f":"SUM(IF((INDEX(compo,2,)='Données cumul depuis janvier'!A56)*(INDEX(compo,,1)=$A$52),INDEX(compo,,),0))","v":0},"Tubes, tuyaux en matière plastique",0.04,{"$f":"HLOOKUP(C56,'Composition index'!$A$2:$AR$3,2,FALSE)","v":"010534207"},{"$f":"SUM(IF((INDEX(base_indices,1,)=E56)*(INDEX(base_indices,,1)>='Données cumul depuis janvier'!$B$1)*(INDEX(base_indices,,1)<='Données cumul depuis janvier'!$C$1),INDEX(base_indices,,),0))/SUM(IF((INDEX(base_indices,1,)=E56)*(INDEX(base_indices,,1)>='Données cumul depuis janvier'!$D$1)*(INDEX(base_indices,,1)<='Données cumul depuis janvier'!$E$1),INDEX(base_indices,,),0))-1","v":0.11908809119088093},{"$f":"SUM(IF((INDEX(base_indices,1,)=E56)*(INDEX(base_indices,,1)>=$B$3)*(INDEX(base_indices,,1)<=$C$3),INDEX(base_indices,,),0))/SUM(IF((INDEX(base_indices,1,)=E56)*(INDEX(base_indices,,1)>=$D$3)*(INDEX(base_indices,,1)<=$E$3),INDEX(base_indices,,),0))-1","v":0.12234255916566394},null,2,null,{"$f":"SUM(IF((INDEX(base_indices,1,)=E56)*(INDEX(base_indices,,1)='Indice prix'!A$59),INDEX(base_indices,,),0))","v":0}]
[{"$f":"OFFSET('Composition index'!$J$2,0,I57)","v":"Gazole routier HTT"},{"$f":"SUM(IF((INDEX(compo,2,)='Données cumul depuis janvier'!A57)*(INDEX(compo,,1)=$A$52),INDEX(compo,,),0))","v":0},"Ensemble des produits du sciage",0.02,{"$f":"HLOOKUP(C57,'Composition index'!$A$2:$AR$3,2,FALSE)","v":"010534575"},{"$f":"SUM(IF((INDEX(base_indices,1,)=E57)*(INDEX(base_indices,,1)>='Données cumul depuis janvier'!$B$1)*(INDEX(base_indices,,1)<='Données cumul depuis janvier'!$C$1),INDEX(base_indices,,),0))/SUM(IF((INDEX(base_indices,1,)=E57)*(INDEX(base_indices,,1)>='Données cumul depuis janvier'!$D$1)*(INDEX(base_indices,,1)<='Données cumul depuis janvier'!$E$1),INDEX(base_indices,,),0))-1","v":0.15890939135224502},{"$f":"SUM(IF((INDEX(base_indices,1,)=E57)*(INDEX(base_indices,,1)>=$B$3)*(INDEX(base_indices,,1)<=$C$3),INDEX(base_indices,,),0))/SUM(IF((INDEX(base_indices,1,)=E57)*(INDEX(base_indices,,1)>=$D$3)*(INDEX(base_indices,,1)<=$E$3),INDEX(base_indices,,),0))-1","v":0.17970283151107402},null,3,null,{"$f":"SUM(IF((INDEX(base_indices,1,)=E57)*(INDEX(base_indices,,1)='Indice prix'!A$59),INDEX(base_indices,,),0))","v":0}]
[{"$f":"OFFSET('Composition index'!$J$2,0,I58)","v":"Tubes, tuyaux en matière plastique"},{"$f":"SUM(IF((INDEX(compo,2,)='Données cumul depuis janvier'!A58)*(INDEX(compo,,1)=$A$52),INDEX(compo,,),0))","v":0.04},"Électricité vendue aux entreprises consommatrices finales",0.01,{"$f":"HLOOKUP(C58,'Composition index'!$A$2:$AR$3,2,FALSE)","v":"010534769"},{"$f":"SUM(IF((INDEX(base_indices,1,)=E58)*(INDEX(base_indices,,1)>='Données cumul depuis janvier'!$B$1)*(INDEX(base_indices,,1)<='Données cumul depuis janvier'!$C$1),INDEX(base_indices,,),0))/SUM(IF((INDEX(base_indices,1,)=E58)*(INDEX(base_indices,,1)>='Données cumul depuis janvier'!$D$1)*(INDEX(base_indices,,1)<='Données cumul depuis janvier'!$E$1),INDEX(base_indices,,),0))-1","v":8.3452211126961551E-2},{"$f":"SUM(IF((INDEX(base_indices,1,)=E58)*(INDEX(base_indices,,1)>=$B$3)*(INDEX(base_indices,,1)<=$C$3),INDEX(base_indices,,),0))/SUM(IF((INDEX(base_indices,1,)=E58)*(INDEX(base_indices,,1)>=$D$3)*(INDEX(base_indices,,1)<=$E$3),INDEX(base_indices,,),0))-1","v":3.987677562895775E-2},null,4,null,{"$f":"SUM(IF((INDEX(base_indices,1,)=E58)*(INDEX(base_indices,,1)='Indice prix'!A$59),INDEX(base_indices,,),0))","v":0}]
[{"$f":"OFFSET('Composition index'!$J$2,0,I59)","v":"Ensemble des produits du sciage"},{"$f":"SUM(IF((INDEX(compo,2,)='Données cumul depuis janvier'!A59)*(INDEX(compo,,1)=$A$52),INDEX(compo,,),0))","v":0.02},"Travail activités spécialisées",0,{"$f":"HLOOKUP(C59,'Composition index'!$A$2:$AR$3,2,FALSE)","v":"001565195"},{"$f":"SUM(IF((INDEX(base_indices,1,)=E59)*(INDEX(base_indices,,1)>='Données cumul depuis janvier'!$B$1)*(INDEX(base_indices,,1)<='Données cumul depuis janvier'!$C$1),INDEX(base_indices,,),0))/SUM(IF((INDEX(base_indices,1,)=E59)*(INDEX(base_indices,,1)>='Données cumul depuis janvier'!$D$1)*(INDEX(base_indices,,1)<='Données cumul depuis janvier'!$E$1),INDEX(base_indices,,),0))-1","v":3.3082077051926229E-2},{"$f":"SUM(IF((INDEX(base_indices,1,)=E59)*(INDEX(base_indices,,1)>=$B$3)*(INDEX(base_indices,,1)<=$C$3),INDEX(base_indices,,),0))/SUM(IF((INDEX(base_indices,1,)=E59)*(INDEX(base_indices,,1)>=$D$3)*(INDEX(base_indices,,1)<=$E$3),INDEX(base_indices,,),0))-1","v":1.5477072528196301E-2},null,5,null,{"$f":"SUM(IF((INDEX(base_indices,1,)=E59)*(INDEX(base_indices,,1)='Indice prix'!A$59),INDEX(base_indices,,),0))","v":1}]
[{"$f":"OFFSET('Composition index'!$J$2,0,I60)","v":"Béton prêt à l'emploi"},{"$f":"SUM(IF((INDEX(compo,2,)='Données cumul depuis janvier'!A60)*(INDEX(compo,,1)=$A$52),INDEX(compo,,),0))","v":0.12},"Fioul lourd",0,{"$f":"HLOOKUP(C60,'Composition index'!$A$2:$AR$3,2,FALSE)","v":"Fioul lourd"},{"$f":"SUM(IF((INDEX(base_indices,1,)=E60)*(INDEX(base_indices,,1)>='Données cumul depuis janvier'!$B$1)*(INDEX(base_indices,,1)<='Données cumul depuis janvier'!$C$1),INDEX(base_indices,,),0))/SUM(IF((INDEX(base_indices,1,)=E60)*(INDEX(base_indices,,1)>='Données cumul depuis janvier'!$D$1)*(INDEX(base_indices,,1)<='Données cumul depuis janvier'!$E$1),INDEX(base_indices,,),0))-1","v":-0.15323196234867797},{"$f":"SUM(IF((INDEX(base_indices,1,)=E60)*(INDEX(base_indices,,1)>=$B$3)*(INDEX(base_indices,,1)<=$C$3),INDEX(base_indices,,),0))/SUM(IF((INDEX(base_indices,1,)=E60)*(INDEX(base_indices,,1)>=$D$3)*(INDEX(base_indices,,1)<=$E$3),INDEX(base_indices,,),0))-1","v":0.34776709988821985},null,6,null,{"$f":"SUM(IF((INDEX(base_indices,1,)=E60)*(INDEX(base_indices,,1)='Indice prix'!A$59),INDEX(base_indices,,),0))","v":0}]
[{"$f":"OFFSET('Composition index'!$J$2,0,I61)","v":"Barres crénelées ou nervurées pour béton armé"},{"$f":"SUM(IF((INDEX(compo,2,)='Données cumul depuis janvier'!A61)*(INDEX(compo,,1)=$A$52),INDEX(compo,,),0))","v":0.09},"Gazole routier HTT",0,{"$f":"HLOOKUP(C61,'Composition index'!$A$2:$AR$3,2,FALSE)","v":"Gazole routier HTT"},{"$f":"SUM(IF((INDEX(base_indices,1,)=E61)*(INDEX(base_indices,,1)>='Données cumul depuis janvier'!$B$1)*(INDEX(base_indices,,1)<='Données cumul depuis janvier'!$C$1),INDEX(base_indices,,),0))/SUM(IF((INDEX(base_indices,1,)=E61)*(INDEX(base_indices,,1)>='Données cumul depuis janvier'!$D$1)*(INDEX(base_indices,,1)<='Données cumul depuis janvier'!$E$1),INDEX(base_indices,,),0))-1","v":-0.15005089240728497},{"$f":"SUM(IF((INDEX(base_indices,1,)=E61)*(INDEX(base_indices,,1)>=$B$3)*(INDEX(base_indices,,1)<=$C$3),INDEX(base_indices,,),0))/SUM(IF((INDEX(base_indices,1,)=E61)*(INDEX(base_indices,,1)>=$D$3)*(INDEX(base_indices,,1)<=$E$3),INDEX(base_indices,,),0))-1","v":0.35283028274210348},null,7,null,{"$f":"SUM(IF((INDEX(base_indices,1,)=E61)*(INDEX(base_indices,,1)='Indice prix'!A$59),INDEX(base_indices,,),0))","v":0}]
[{"$f":"OFFSET('Composition index'!$J$2,0,I62)","v":"Sables et granulats"},{"$f":"SUM(IF((INDEX(compo,2,)='Données cumul depuis janvier'!A62)*(INDEX(compo,,1)=$A$52),INDEX(compo,,),0))","v":0},"Sables et granulats",0,{"$f":"HLOOKUP(C62,'Composition index'!$A$2:$AR$3,2,FALSE)","v":"010536067"},{"$f":"SUM(IF((INDEX(base_indices,1,)=E62)*(INDEX(base_indices,,1)>='Données cumul depuis janvier'!$B$1)*(INDEX(base_indices,,1)<='Données cumul depuis janvier'!$C$1),INDEX(base_indices,,),0))/SUM(IF((INDEX(base_indices,1,)=E62)*(INDEX(base_indices,,1)>='Données cumul depuis janvier'!$D$1)*(INDEX(base_indices,,1)<='Données cumul depuis janvier'!$E$1),INDEX(base_indices,,),0))-1","v":2.8410772417875041E-2},{"$f":"SUM(IF((INDEX(base_indices,1,)=E62)*(INDEX(base_indices,,1)>=$B$3)*(INDEX(base_indices,,1)<=$C$3),INDEX(base_indices,,),0))/SUM(IF((INDEX(base_indices,1,)=E62)*(INDEX(base_indices,,1)>=$D$3)*(INDEX(base_indices,,1)<=$E$3),INDEX(base_indices,,),0))-1","v":1.1743012422360088E-2},null,8,null,{"$f":"SUM(IF((INDEX(base_indices,1,)=E62)*(INDEX(base_indices,,1)='Indice prix'!A$59),INDEX(base_indices,,),0))","v":0}]
[{"$f":"OFFSET('Composition index'!$J$2,0,I63)","v":"Plaques, feuilles, tubes et profilés en matières plastiques"},{"$f":"SUM(IF((INDEX(compo,2,)='Données cumul depuis janvier'!A63)*(INDEX(compo,,1)=$A$52),INDEX(compo,,),0))","v":0},"Plaques, feuilles, tubes et profilés en matières plastiques",0,{"$f":"HLOOKUP(C63,'Composition index'!$A$2:$AR$3,2,FALSE)","v":"010534625"},{"$f":"SUM(IF((INDEX(base_indices,1,)=E63)*(INDEX(base_indices,,1)>='Données cumul depuis janvier'!$B$1)*(INDEX(base_indices,,1)<='Données cumul depuis janvier'!$C$1),INDEX(base_indices,,),0))/SUM(IF((INDEX(base_indices,1,)=E63)*(INDEX(base_indices,,1)>='Données cumul depuis janvier'!$D$1)*(INDEX(base_indices,,1)<='Données cumul depuis janvier'!$E$1),INDEX(base_indices,,),0))-1","v":0.11074594163927909},{"$f":"SUM(IF((INDEX(base_indices,1,)=E63)*(INDEX(base_indices,,1)>=$B$3)*(INDEX(base_indices,,1)<=$C$3),INDEX(base_indices,,),0))/SUM(IF((INDEX(base_indices,1,)=E63)*(INDEX(base_indices,,1)>=$D$3)*(INDEX(base_indices,,1)<=$E$3),INDEX(base_indices,,),0))-1","v":0.16080349708576192},null,9,null,{"$f":"SUM(IF((INDEX(base_indices,1,)=E63)*(INDEX(base_indices,,1)='Indice prix'!A$59),INDEX(base_indices,,),0))","v":0}]
[{"$f":"OFFSET('Composition index'!$J$2,0,I64)","v":"Ciment, chaux et plâtre"},{"$f":"SUM(IF((INDEX(compo,2,)='Données cumul depuis janvier'!A64)*(INDEX(compo,,1)=$A$52),INDEX(compo,,),0))","v":0},"Ciment, chaux et plâtre",0,{"$f":"HLOOKUP(C64,'Composition index'!$A$2:$AR$3,2,FALSE)","v":"010534642"},{"$f":"SUM(IF((INDEX(base_indices,1,)=E64)*(INDEX(base_indices,,1)>='Données cumul depuis janvier'!$B$1)*(INDEX(base_indices,,1)<='Données cumul depuis janvier'!$C$1),INDEX(base_indices,,),0))/SUM(IF((INDEX(base_indices,1,)=E64)*(INDEX(base_indices,,1)>='Données cumul depuis janvier'!$D$1)*(INDEX(base_indices,,1)<='Données cumul depuis janvier'!$E$1),INDEX(base_indices,,),0))-1","v":2.4824081313526092E-2},{"$f":"SUM(IF((INDEX(base_indices,1,)=E64)*(INDEX(base_indices,,1)>=$B$3)*(INDEX(base_indices,,1)<=$C$3),INDEX(base_indices,,),0))/SUM(IF((INDEX(base_indices,1,)=E64)*(INDEX(base_indices,,1)>=$D$3)*(INDEX(base_indices,,1)<=$E$3),INDEX(base_indices,,),0))-1","v":2.3323899677954341E-2},null,10,null,{"$f":"SUM(IF((INDEX(base_indices,1,)=E64)*(INDEX(base_indices,,1)='Indice prix'!A$59),INDEX(base_indices,,),0))","v":0}]
[{"$f":"OFFSET('Composition index'!$J$2,0,I65)","v":"Produits explosifs"},{"$f":"SUM(IF((INDEX(compo,2,)='Données cumul depuis janvier'!A65)*(INDEX(compo,,1)=$A$52),INDEX(compo,,),0))","v":0},"Produits explosifs",0,{"$f":"HLOOKUP(C65,'Composition index'!$A$2:$AR$3,2,FALSE)","v":"010534614"},{"$f":"SUM(IF((INDEX(base_indices,1,)=E65)*(INDEX(base_indices,,1)>='Données cumul depuis janvier'!$B$1)*(INDEX(base_indices,,1)<='Données cumul depuis janvier'!$C$1),INDEX(base_indices,,),0))/SUM(IF((INDEX(base_indices,1,)=E65)*(INDEX(base_indices,,1)>='Données cumul depuis janvier'!$D$1)*(INDEX(base_indices,,1)<='Données cumul depuis janvier'!$E$1),INDEX(base_indices,,),0))-1","v":6.6847510172445279E-3},{"$f":"SUM(IF((INDEX(base_indices,1,)=E65)*(INDEX(base_indices,,1)>=$B$3)*(INDEX(base_indices,,1)<=$C$3),INDEX(base_indices,,),0))/SUM(IF((INDEX(base_indices,1,)=E65)*(INDEX(base_indices,,1)>=$D$3)*(INDEX(base_indices,,1)<=$E$3),INDEX(base_indices,,),0))-1","v":-1.6333589546503324E-3},null,11,null,{"$f":"SUM(IF((INDEX(base_indices,1,)=E65)*(INDEX(base_indices,,1)='Indice prix'!A$59),INDEX(base_indices,,),0))","v":0}]
[{"$f":"OFFSET('Composition index'!$J$2,0,I66)","v":"Acier pour la construction"},{"$f":"SUM(IF((INDEX(compo,2,)='Données cumul depuis janvier'!A66)*(INDEX(compo,,1)=$A$52),INDEX(compo,,),0))","v":0},"Acier pour la construction",0,{"$f":"HLOOKUP(C66,'Composition index'!$A$2:$AR$3,2,FALSE)","v":"010536462"},{"$f":"SUM(IF((INDEX(base_indices,1,)=E66)*(INDEX(base_indices,,1)>='Données cumul depuis janvier'!$B$1)*(INDEX(base_indices,,1)<='Données cumul depuis janvier'!$C$1),INDEX(base_indices,,),0))/SUM(IF((INDEX(base_indices,1,)=E66)*(INDEX(base_indices,,1)>='Données cumul depuis janvier'!$D$1)*(INDEX(base_indices,,1)<='Données cumul depuis janvier'!$E$1),INDEX(base_indices,,),0))-1","v":0.34676065793890554},{"$f":"SUM(IF((INDEX(base_indices,1,)=E66)*(INDEX(base_indices,,1)>=$B$3)*(INDEX(base_indices,,1)<=$C$3),INDEX(base_indices,,),0))/SUM(IF((INDEX(base_indices,1,)=E66)*(INDEX(base_indices,,1)>=$D$3)*(INDEX(base_indices,,1)<=$E$3),INDEX(base_indices,,),0))-1","v":0.47459340255444271},null,12,null,{"$f":"SUM(IF((INDEX(base_indices,1,)=E66)*(INDEX(base_indices,,1)='Indice prix'!A$59),INDEX(base_indices,,),0))","v":0}]
[{"$f":"OFFSET('Composition index'!$J$2,0,I67)","v":"Bitume"},{"$f":"SUM(IF((INDEX(compo,2,)='Données cumul depuis janvier'!A67)*(INDEX(compo,,1)=$A$52),INDEX(compo,,),0))","v":0},"Bitume",0,{"$f":"HLOOKUP(C67,'Composition index'!$A$2:$AR$3,2,FALSE)","v":"010534598"},{"$f":"SUM(IF((INDEX(base_indices,1,)=E67)*(INDEX(base_indices,,1)>='Données cumul depuis janvier'!$B$1)*(INDEX(base_indices,,1)<='Données cumul depuis janvier'!$C$1),INDEX(base_indices,,),0))/SUM(IF((INDEX(base_indices,1,)=E67)*(INDEX(base_indices,,1)>='Données cumul depuis janvier'!$D$1)*(INDEX(base_indices,,1)<='Données cumul depuis janvier'!$E$1),INDEX(base_indices,,),0))-1","v":6.0575769692123194E-2},{"$f":"SUM(IF((INDEX(base_indices,1,)=E67)*(INDEX(base_indices,,1)>=$B$3)*(INDEX(base_indices,,1)<=$C$3),INDEX(base_indices,,),0))/SUM(IF((INDEX(base_indices,1,)=E67)*(INDEX(base_indices,,1)>=$D$3)*(INDEX(base_indices,,1)<=$E$3),INDEX(base_indices,,),0))-1","v":0.1784524250277677},null,13,null,{"$f":"SUM(IF((INDEX(base_indices,1,)=E67)*(INDEX(base_indices,,1)='Indice prix'!A$59),INDEX(base_indices,,),0))","v":0}]
[{"$f":"OFFSET('Composition index'!$J$2,0,I68)","v":"Produits de voierie en béton"},{"$f":"SUM(IF((INDEX(compo,2,)='Données cumul depuis janvier'!A68)*(INDEX(compo,,1)=$A$52),INDEX(compo,,),0))","v":0},"Produits de voierie en béton",0,{"$f":"HLOOKUP(C68,'Composition index'!$A$2:$AR$3,2,FALSE)","v":"010534252"},{"$f":"SUM(IF((INDEX(base_indices,1,)=E68)*(INDEX(base_indices,,1)>='Données cumul depuis janvier'!$B$1)*(INDEX(base_indices,,1)<='Données cumul depuis janvier'!$C$1),INDEX(base_indices,,),0))/SUM(IF((INDEX(base_indices,1,)=E68)*(INDEX(base_indices,,1)>='Données cumul depuis janvier'!$D$1)*(INDEX(base_indices,,1)<='Données cumul depuis janvier'!$E$1),INDEX(base_indices,,),0))-1","v":7.7738165973459949E-2},{"$f":"SUM(IF((INDEX(base_indices,1,)=E68)*(INDEX(base_indices,,1)>=$B$3)*(INDEX(base_indices,,1)<=$C$3),INDEX(base_indices,,),0))/SUM(IF((INDEX(base_indices,1,)=E68)*(INDEX(base_indices,,1)>=$D$3)*(INDEX(base_indices,,1)<=$E$3),INDEX(base_indices,,),0))-1","v":4.0738261451659152E-2},null,14,null,{"$f":"SUM(IF((INDEX(base_indices,1,)=E68)*(INDEX(base_indices,,1)='Indice prix'!A$59),INDEX(base_indices,,),0))","v":0}]
[{"$f":"OFFSET('Composition index'!$J$2,0,I69)","v":"Mortiers et bétons secs"},{"$f":"SUM(IF((INDEX(compo,2,)='Données cumul depuis janvier'!A69)*(INDEX(compo,,1)=$A$52),INDEX(compo,,),0))","v":0},"Mortiers et bétons secs",0,{"$f":"HLOOKUP(C69,'Composition index'!$A$2:$AR$3,2,FALSE)","v":"010534647"},{"$f":"SUM(IF((INDEX(base_indices,1,)=E69)*(INDEX(base_indices,,1)>='Données cumul depuis janvier'!$B$1)*(INDEX(base_indices,,1)<='Données cumul depuis janvier'!$C$1),INDEX(base_indices,,),0))/SUM(IF((INDEX(base_indices,1,)=E69)*(INDEX(base_indices,,1)>='Données cumul depuis janvier'!$D$1)*(INDEX(base_indices,,1)<='Données cumul depuis janvier'!$E$1),INDEX(base_indices,,),0))-1","v":2.0363125689638162E-2},{"$f":"SUM(IF((INDEX(base_indices,1,)=E69)*(INDEX(base_indices,,1)>=$B$3)*(INDEX(base_indices,,1)<=$C$3),INDEX(base_indices,,),0))/SUM(IF((INDEX(base_indices,1,)=E69)*(INDEX(base_indices,,1)>=$D$3)*(INDEX(base_indices,,1)<=$E$3),INDEX(base_indices,,),0))-1","v":9.9285146942018621E-3},null,15,null,{"$f":"SUM(IF((INDEX(base_indices,1,)=E69)*(INDEX(base_indices,,1)='Indice prix'!A$59),INDEX(base_indices,,),0))","v":0}]
[{"$f":"OFFSET('Composition index'!$J$2,0,I70)","v":"Travaux de fonderie de fonte"},{"$f":"SUM(IF((INDEX(compo,2,)='Données cumul depuis janvier'!A70)*(INDEX(compo,,1)=$A$52),INDEX(compo,,),0))","v":0},"Travaux de fonderie de fonte",0,{"$f":"HLOOKUP(C70,'Composition index'!$A$2:$AR$3,2,FALSE)","v":"010534662"},{"$f":"SUM(IF((INDEX(base_indices,1,)=E70)*(INDEX(base_indices,,1)>='Données cumul depuis janvier'!$B$1)*(INDEX(base_indices,,1)<='Données cumul depuis janvier'!$C$1),INDEX(base_indices,,),0))/SUM(IF((INDEX(base_indices,1,)=E70)*(INDEX(base_indices,,1)>='Données cumul depuis janvier'!$D$1)*(INDEX(base_indices,,1)<='Données cumul depuis janvier'!$E$1),INDEX(base_indices,,),0))-1","v":4.4941449519991572E-2},{"$f":"SUM(IF((INDEX(base_indices,1,)=E70)*(INDEX(base_indices,,1)>=$B$3)*(INDEX(base_indices,,1)<=$C$3),INDEX(base_indices,,),0))/SUM(IF((INDEX(base_indices,1,)=E70)*(INDEX(base_indices,,1)>=$D$3)*(INDEX(base_indices,,1)<=$E$3),INDEX(base_indices,,),0))-1","v":5.305124388688065E-2},null,16,null,{"$f":"SUM(IF((INDEX(base_indices,1,)=E70)*(INDEX(base_indices,,1)='Indice prix'!A$59),INDEX(base_indices,,),0))","v":0}]
[{"$f":"OFFSET('Composition index'!$J$2,0,I71)","v":"Tuiles, briques et produits de construction en terre cuite"},{"$f":"SUM(IF((INDEX(compo,2,)='Données cumul depuis janvier'!A71)*(INDEX(compo,,1)=$A$52),INDEX(compo,,),0))","v":0},"Tuiles, briques et produits de construction en terre cuite",0,{"$f":"HLOOKUP(C71,'Composition index'!$A$2:$AR$3,2,FALSE)","v":"010534638"},{"$f":"SUM(IF((INDEX(base_indices,1,)=E71)*(INDEX(base_indices,,1)>='Données cumul depuis janvier'!$B$1)*(INDEX(base_indices,,1)<='Données cumul depuis janvier'!$C$1),INDEX(base_indices,,),0))/SUM(IF((INDEX(base_indices,1,)=E71)*(INDEX(base_indices,,1)>='Données cumul depuis janvier'!$D$1)*(INDEX(base_indices,,1)<='Données cumul depuis janvier'!$E$1),INDEX(base_indices,,),0))-1","v":2.6193993106844005E-2},{"$f":"SUM(IF((INDEX(base_indices,1,)=E71)*(INDEX(base_indices,,1)>=$B$3)*(INDEX(base_indices,,1)<=$C$3),INDEX(base_indices,,),0))/SUM(IF((INDEX(base_indices,1,)=E71)*(INDEX(base_indices,,1)>=$D$3)*(INDEX(base_indices,,1)<=$E$3),INDEX(base_indices,,),0))-1","v":9.2000774743365987E-3},null,17,null,{"$f":"SUM(IF((INDEX(base_indices,1,)=E71)*(INDEX(base_indices,,1)='Indice prix'!A$59),INDEX(base_indices,,),0))","v":0}]
[{"$f":"OFFSET('Composition index'!$J$2,0,I72)","v":"Tuyaux d'assainissement"},{"$f":"SUM(IF((INDEX(compo,2,)='Données cumul depuis janvier'!A72)*(INDEX(compo,,1)=$A$52),INDEX(compo,,),0))","v":0},"Tuyaux d'assainissement",0,{"$f":"HLOOKUP(C72,'Composition index'!$A$2:$AR$3,2,FALSE)","v":"010534253"},{"$f":"SUM(IF((INDEX(base_indices,1,)=E72)*(INDEX(base_indices,,1)>='Données cumul depuis janvier'!$B$1)*(INDEX(base_indices,,1)<='Données cumul depuis janvier'!$C$1),INDEX(base_indices,,),0))/SUM(IF((INDEX(base_indices,1,)=E72)*(INDEX(base_indices,,1)>='Données cumul depuis janvier'!$D$1)*(INDEX(base_indices,,1)<='Données cumul depuis janvier'!$E$1),INDEX(base_indices,,),0))-1","v":3.4417189579767804E-2},{"$f":"SUM(IF((INDEX(base_indices,1,)=E72)*(INDEX(base_indices,,1)>=$B$3)*(INDEX(base_indices,,1)<=$C$3),INDEX(base_indices,,),0))/SUM(IF((INDEX(base_indices,1,)=E72)*(INDEX(base_indices,,1)>=$D$3)*(INDEX(base_indices,,1)<=$E$3),INDEX(base_indices,,),0))-1","v":5.6208135132511217E-2},null,18,null,{"$f":"SUM(IF((INDEX(base_indices,1,)=E72)*(INDEX(base_indices,,1)='Indice prix'!A$59),INDEX(base_indices,,),0))","v":1}]
[{"$f":"OFFSET('Composition index'!$J$2,0,I73)","v":"Autres textiles n.c.a."},{"$f":"SUM(IF((INDEX(compo,2,)='Données cumul depuis janvier'!A73)*(INDEX(compo,,1)=$A$52),INDEX(compo,,),0))","v":0},"Autres textiles n.c.a.",0,{"$f":"HLOOKUP(C73,'Composition index'!$A$2:$AR$3,2,FALSE)","v":"010534559"},{"$f":"SUM(IF((INDEX(base_indices,1,)=E73)*(INDEX(base_indices,,1)>='Données cumul depuis janvier'!$B$1)*(INDEX(base_indices,,1)<='Données cumul depuis janvier'!$C$1),INDEX(base_indices,,),0))/SUM(IF((INDEX(base_indices,1,)=E73)*(INDEX(base_indices,,1)>='Données cumul depuis janvier'!$D$1)*(INDEX(base_indices,,1)<='Données cumul depuis janvier'!$E$1),INDEX(base_indices,,),0))-1","v":1.0188015189402932E-3},{"$f":"SUM(IF((INDEX(base_indices,1,)=E73)*(INDEX(base_indices,,1)>=$B$3)*(INDEX(base_indices,,1)<=$C$3),INDEX(base_indices,,),0))/SUM(IF((INDEX(base_indices,1,)=E73)*(INDEX(base_indices,,1)>=$D$3)*(INDEX(base_indices,,1)<=$E$3),INDEX(base_indices,,),0))-1","v":-4.3298019345924255E-3},null,19,null,{"$f":"SUM(IF((INDEX(base_indices,1,)=E73)*(INDEX(base_indices,,1)='Indice prix'!A$59),INDEX(base_indices,,),0))","v":0}]
[{"$f":"OFFSET('Composition index'!$J$2,0,I74)","v":"Matières plastiques sous formes primaires"},{"$f":"SUM(IF((INDEX(compo,2,)='Données cumul depuis janvier'!A74)*(INDEX(compo,,1)=$A$52),INDEX(compo,,),0))","v":0},"Matières plastiques sous formes primaires",0,{"$f":"HLOOKUP(C74,'Composition index'!$A$2:$AR$3,2,FALSE)","v":"010534606"},{"$f":"SUM(IF((INDEX(base_indices,1,)=E74)*(INDEX(base_indices,,1)>='Données cumul depuis janvier'!$B$1)*(INDEX(base_indices,,1)<='Données cumul depuis janvier'!$C$1),INDEX(base_indices,,),0))/SUM(IF((INDEX(base_indices,1,)=E74)*(INDEX(base_indices,,1)>='Données cumul depuis janvier'!$D$1)*(INDEX(base_indices,,1)<='Données cumul depuis janvier'!$E$1),INDEX(base_indices,,),0))-1","v":0.24695887236918335},{"$f":"SUM(IF((INDEX(base_indices,1,)=E74)*(INDEX(base_indices,,1)>=$B$3)*(INDEX(base_indices,,1)<=$C$3),INDEX(base_indices,,),0))/SUM(IF((INDEX(base_indices,1,)=E74)*(INDEX(base_indices,,1)>=$D$3)*(INDEX(base_indices,,1)<=$E$3),INDEX(base_indices,,),0))-1","v":0.41793830277747301},null,20,null,{"$f":"SUM(IF((INDEX(base_indices,1,)=E74)*(INDEX(base_indices,,1)='Indice prix'!A$59),INDEX(base_indices,,),0))","v":0}]
[{"$f":"OFFSET('Composition index'!$J$2,0,I75)","v":"Tubes, tuyaux, profilés creux et accessoires correspondants en acier"},{"$f":"SUM(IF((INDEX(compo,2,)='Données cumul depuis janvier'!A75)*(INDEX(compo,,1)=$A$52),INDEX(compo,,),0))","v":0},"Tubes, tuyaux, profilés creux et accessoires correspondants en acier",0,{"$f":"HLOOKUP(C75,'Composition index'!$A$2:$AR$3,2,FALSE)","v":"010534654"},{"$f":"SUM(IF((INDEX(base_indices,1,)=E75)*(INDEX(base_indices,,1)>='Données cumul depuis janvier'!$B$1)*(INDEX(base_indices,,1)<='Données cumul depuis janvier'!$C$1),INDEX(base_indices,,),0))/SUM(IF((INDEX(base_indices,1,)=E75)*(INDEX(base_indices,,1)>='Données cumul depuis janvier'!$D$1)*(INDEX(base_indices,,1)<='Données cumul depuis janvier'!$E$1),INDEX(base_indices,,),0))-1","v":5.9573675881969601E-2},{"$f":"SUM(IF((INDEX(base_indices,1,)=E75)*(INDEX(base_indices,,1)>=$B$3)*(INDEX(base_indices,,1)<=$C$3),INDEX(base_indices,,),0))/SUM(IF((INDEX(base_indices,1,)=E75)*(INDEX(base_indices,,1)>=$D$3)*(INDEX(base_indices,,1)<=$E$3),INDEX(base_indices,,),0))-1","v":8.0596164799696002E-2},null,21,null,{"$f":"SUM(IF((INDEX(base_indices,1,)=E75)*(INDEX(base_indices,,1)='Indice prix'!A$59),INDEX(base_indices,,),0))","v":0}]
[{"$f":"OFFSET('Composition index'!$J$2,0,I76)","v":"Éléments en béton pour la construction"},{"$f":"SUM(IF((INDEX(compo,2,)='Données cumul depuis janvier'!A76)*(INDEX(compo,,1)=$A$52),INDEX(compo,,),0))","v":0},"Éléments en béton pour la construction",0,{"$f":"HLOOKUP(C76,'Composition index'!$A$2:$AR$3,2,FALSE)","v":"010534645"},{"$f":"SUM(IF((INDEX(base_indices,1,)=E76)*(INDEX(base_indices,,1)>='Données cumul depuis janvier'!$B$1)*(INDEX(base_indices,,1)<='Données cumul depuis janvier'!$C$1),INDEX(base_indices,,),0))/SUM(IF((INDEX(base_indices,1,)=E76)*(INDEX(base_indices,,1)>='Données cumul depuis janvier'!$D$1)*(INDEX(base_indices,,1)<='Données cumul depuis janvier'!$E$1),INDEX(base_indices,,),0))-1","v":4.2005958291956302E-2},{"$f":"SUM(IF((INDEX(base_indices,1,)=E76)*(INDEX(base_indices,,1)>=$B$3)*(INDEX(base_indices,,1)<=$C$3),INDEX(base_indices,,),0))/SUM(IF((INDEX(base_indices,1,)=E76)*(INDEX(base_indices,,1)>=$D$3)*(INDEX(base_indices,,1)<=$E$3),INDEX(base_indices,,),0))-1","v":1.5975987606506425E-2},null,22,null,{"$f":"SUM(IF((INDEX(base_indices,1,)=E76)*(INDEX(base_indices,,1)='Indice prix'!A$59),INDEX(base_indices,,),0))","v":0}]
[{"$f":"OFFSET('Composition index'!$J$2,0,I77)","v":"Fils et câbles d'énergie"},{"$f":"SUM(IF((INDEX(compo,2,)='Données cumul depuis janvier'!A77)*(INDEX(compo,,1)=$A$52),INDEX(compo,,),0))","v":0},"Fils et câbles d'énergie",0,{"$f":"HLOOKUP(C77,'Composition index'!$A$2:$AR$3,2,FALSE)","v":"010534330"},{"$f":"SUM(IF((INDEX(base_indices,1,)=E77)*(INDEX(base_indices,,1)>='Données cumul depuis janvier'!$B$1)*(INDEX(base_indices,,1)<='Données cumul depuis janvier'!$C$1),INDEX(base_indices,,),0))/SUM(IF((INDEX(base_indices,1,)=E77)*(INDEX(base_indices,,1)>='Données cumul depuis janvier'!$D$1)*(INDEX(base_indices,,1)<='Données cumul depuis janvier'!$E$1),INDEX(base_indices,,),0))-1","v":0.17735220649458738},{"$f":"SUM(IF((INDEX(base_indices,1,)=E77)*(INDEX(base_indices,,1)>=$B$3)*(INDEX(base_indices,,1)<=$C$3),INDEX(base_indices,,),0))/SUM(IF((INDEX(base_indices,1,)=E77)*(INDEX(base_indices,,1)>=$D$3)*(INDEX(base_indices,,1)<=$E$3),INDEX(base_indices,,),0))-1","v":0.18786096818229558},null,23,null,{"$f":"SUM(IF((INDEX(base_indices,1,)=E77)*(INDEX(base_indices,,1)='Indice prix'!A$59),INDEX(base_indices,,),0))","v":1}]
[{"$f":"OFFSET('Composition index'!$J$2,0,I78)","v":"Moteurs, génératrices, transfo. électr., matér. distrib., cmde électr."},{"$f":"SUM(IF((INDEX(compo,2,)='Données cumul depuis janvier'!A78)*(INDEX(compo,,1)=$A$52),INDEX(compo,,),0))","v":0},"Moteurs, génératrices, transfo. électr., matér. distrib., cmde électr.",0,{"$f":"HLOOKUP(C78,'Composition index'!$A$2:$AR$3,2,FALSE)","v":"010534696"},{"$f":"SUM(IF((INDEX(base_indices,1,)=E78)*(INDEX(base_indices,,1)>='Données cumul depuis janvier'!$B$1)*(INDEX(base_indices,,1)<='Données cumul depuis janvier'!$C$1),INDEX(base_indices,,),0))/SUM(IF((INDEX(base_indices,1,)=E78)*(INDEX(base_indices,,1)>='Données cumul depuis janvier'!$D$1)*(INDEX(base_indices,,1)<='Données cumul depuis janvier'!$E$1),INDEX(base_indices,,),0))-1","v":2.6418405147202284E-2},{"$f":"SUM(IF((INDEX(base_indices,1,)=E78)*(INDEX(base_indices,,1)>=$B$3)*(INDEX(base_indices,,1)<=$C$3),INDEX(base_indices,,),0))/SUM(IF((INDEX(base_indices,1,)=E78)*(INDEX(base_indices,,1)>=$D$3)*(INDEX(base_indices,,1)<=$E$3),INDEX(base_indices,,),0))-1","v":1.6018527453440345E-2},null,24,null,{"$f":"SUM(IF((INDEX(base_indices,1,)=E78)*(INDEX(base_indices,,1)='Indice prix'!A$59),INDEX(base_indices,,),0))","v":0}]
[{"$f":"OFFSET('Composition index'!$J$2,0,I79)","v":"Matériel de distribution et de commande électrique"},{"$f":"SUM(IF((INDEX(compo,2,)='Données cumul depuis janvier'!A79)*(INDEX(compo,,1)=$A$52),INDEX(compo,,),0))","v":0},"Matériel de distribution et de commande électrique",0,{"$f":"HLOOKUP(C79,'Composition index'!$A$2:$AR$3,2,FALSE)","v":"010534698"},{"$f":"SUM(IF((INDEX(base_indices,1,)=E79)*(INDEX(base_indices,,1)>='Données cumul depuis janvier'!$B$1)*(INDEX(base_indices,,1)<='Données cumul depuis janvier'!$C$1),INDEX(base_indices,,),0))/SUM(IF((INDEX(base_indices,1,)=E79)*(INDEX(base_indices,,1)>='Données cumul depuis janvier'!$D$1)*(INDEX(base_indices,,1)<='Données cumul depuis janvier'!$E$1),INDEX(base_indices,,),0))-1","v":4.5176563424738525E-2},{"$f":"SUM(IF((INDEX(base_indices,1,)=E79)*(INDEX(base_indices,,1)>=$B$3)*(INDEX(base_indices,,1)<=$C$3),INDEX(base_indices,,),0))/SUM(IF((INDEX(base_indices,1,)=E79)*(INDEX(base_indices,,1)>=$D$3)*(INDEX(base_indices,,1)<=$E$3),INDEX(base_indices,,),0))-1","v":2.485733629944864E-2},null,25,null,{"$f":"SUM(IF((INDEX(base_indices,1,)=E79)*(INDEX(base_indices,,1)='Indice prix'!A$59),INDEX(base_indices,,),0))","v":0}]
[{"$f":"OFFSET('Composition index'!$J$2,0,I80)","v":"Appareils d'éclairage électrique"},{"$f":"SUM(IF((INDEX(compo,2,)='Données cumul depuis janvier'!A80)*(INDEX(compo,,1)=$A$52),INDEX(compo,,),0))","v":0},"Appareils d'éclairage électrique",0,{"$f":"HLOOKUP(C80,'Composition index'!$A$2:$AR$3,2,FALSE)","v":"010534702"},{"$f":"SUM(IF((INDEX(base_indices,1,)=E80)*(INDEX(base_indices,,1)>='Données cumul depuis janvier'!$B$1)*(INDEX(base_indices,,1)<='Données cumul depuis janvier'!$C$1),INDEX(base_indices,,),0))/SUM(IF((INDEX(base_indices,1,)=E80)*(INDEX(base_indices,,1)>='Données cumul depuis janvier'!$D$1)*(INDEX(base_indices,,1)<='Données cumul depuis janvier'!$E$1),INDEX(base_indices,,),0))-1","v":-2.0290732889157947E-2},{"$f":"SUM(IF((INDEX(base_indices,1,)=E80)*(INDEX(base_indices,,1)>=$B$3)*(INDEX(base_indices,,1)<=$C$3),INDEX(base_indices,,),0))/SUM(IF((INDEX(base_indices,1,)=E80)*(INDEX(base_indices,,1)>=$D$3)*(INDEX(base_indices,,1)<=$E$3),INDEX(base_indices,,),0))-1","v":-3.5934291581107836E-3},null,26,null,{"$f":"SUM(IF((INDEX(base_indices,1,)=E80)*(INDEX(base_indices,,1)='Indice prix'!A$59),INDEX(base_indices,,),0))","v":0}]
[{"$f":"OFFSET('Composition index'!$J$2,0,I81)","v":"Câbles de fibres optiques"},{"$f":"SUM(IF((INDEX(compo,2,)='Données cumul depuis janvier'!A81)*(INDEX(compo,,1)=$A$52),INDEX(compo,,),0))","v":0},"Câbles de fibres optiques",0,{"$f":"HLOOKUP(C81,'Composition index'!$A$2:$AR$3,2,FALSE)","v":"010535345"},{"$f":"SUM(IF((INDEX(base_indices,1,)=E81)*(INDEX(base_indices,,1)>='Données cumul depuis janvier'!$B$1)*(INDEX(base_indices,,1)<='Données cumul depuis janvier'!$C$1),INDEX(base_indices,,),0))/SUM(IF((INDEX(base_indices,1,)=E81)*(INDEX(base_indices,,1)>='Données cumul depuis janvier'!$D$1)*(INDEX(base_indices,,1)<='Données cumul depuis janvier'!$E$1),INDEX(base_indices,,),0))-1","v":-4.1188448722695337E-2},{"$f":"SUM(IF((INDEX(base_indices,1,)=E81)*(INDEX(base_indices,,1)>=$B$3)*(INDEX(base_indices,,1)<=$C$3),INDEX(base_indices,,),0))/SUM(IF((INDEX(base_indices,1,)=E81)*(INDEX(base_indices,,1)>=$D$3)*(INDEX(base_indices,,1)<=$E$3),INDEX(base_indices,,),0))-1","v":-2.823639774859299E-2},null,27,null,{"$f":"SUM(IF((INDEX(base_indices,1,)=E81)*(INDEX(base_indices,,1)='Indice prix'!A$59),INDEX(base_indices,,),0))","v":0}]
[{"$f":"OFFSET('Composition index'!$J$2,0,I82)","v":"Peintures Industries"},{"$f":"SUM(IF((INDEX(compo,2,)='Données cumul depuis janvier'!A82)*(INDEX(compo,,1)=$A$52),INDEX(compo,,),0))","v":0},"Peintures Industries",0,{"$f":"HLOOKUP(C82,'Composition index'!$A$2:$AR$3,2,FALSE)","v":"010534180"},{"$f":"SUM(IF((INDEX(base_indices,1,)=E82)*(INDEX(base_indices,,1)>='Données cumul depuis janvier'!$B$1)*(INDEX(base_indices,,1)<='Données cumul depuis janvier'!$C$1),INDEX(base_indices,,),0))/SUM(IF((INDEX(base_indices,1,)=E82)*(INDEX(base_indices,,1)>='Données cumul depuis janvier'!$D$1)*(INDEX(base_indices,,1)<='Données cumul depuis janvier'!$E$1),INDEX(base_indices,,),0))-1","v":5.3460576299453111E-2},{"$f":"SUM(IF((INDEX(base_indices,1,)=E82)*(INDEX(base_indices,,1)>=$B$3)*(INDEX(base_indices,,1)<=$C$3),INDEX(base_indices,,),0))/SUM(IF((INDEX(base_indices,1,)=E82)*(INDEX(base_indices,,1)>=$D$3)*(INDEX(base_indices,,1)<=$E$3),INDEX(base_indices,,),0))-1","v":2.487831260140605E-2},null,28,null,{"$f":"SUM(IF((INDEX(base_indices,1,)=E82)*(INDEX(base_indices,,1)='Indice prix'!A$59),INDEX(base_indices,,),0))","v":0}]
[{"$f":"OFFSET('Composition index'!$J$2,0,I83)","v":"Produits sidérurgiques en acier non allié"},{"$f":"SUM(IF((INDEX(compo,2,)='Données cumul depuis janvier'!A83)*(INDEX(compo,,1)=$A$52),INDEX(compo,,),0))","v":0},"Produits sidérurgiques en acier non allié",0,{"$f":"HLOOKUP(C83,'Composition index'!$A$2:$AR$3,2,FALSE)","v":"010534267"},{"$f":"SUM(IF((INDEX(base_indices,1,)=E83)*(INDEX(base_indices,,1)>='Données cumul depuis janvier'!$B$1)*(INDEX(base_indices,,1)<='Données cumul depuis janvier'!$C$1),INDEX(base_indices,,),0))/SUM(IF((INDEX(base_indices,1,)=E83)*(INDEX(base_indices,,1)>='Données cumul depuis janvier'!$D$1)*(INDEX(base_indices,,1)<='Données cumul depuis janvier'!$E$1),INDEX(base_indices,,),0))-1","v":0.18081926863572417},{"$f":"SUM(IF((INDEX(base_indices,1,)=E83)*(INDEX(base_indices,,1)>=$B$3)*(INDEX(base_indices,,1)<=$C$3),INDEX(base_indices,,),0))/SUM(IF((INDEX(base_indices,1,)=E83)*(INDEX(base_indices,,1)>=$D$3)*(INDEX(base_indices,,1)<=$E$3),INDEX(base_indices,,),0))-1","v":0.26905999055266894},null,29,null,{"$f":"SUM(IF((INDEX(base_indices,1,)=E83)*(INDEX(base_indices,,1)='Indice prix'!A$59),INDEX(base_indices,,),0))","v":0}]
[{"$f":"OFFSET('Composition index'!$J$2,0,I84)","v":"Tôles quarto en aciers non alliés"},{"$f":"SUM(IF((INDEX(compo,2,)='Données cumul depuis janvier'!A84)*(INDEX(compo,,1)=$A$52),INDEX(compo,,),0))","v":0},"Tôles quarto en aciers non alliés",0,{"$f":"HLOOKUP(C84,'Composition index'!$A$2:$AR$3,2,FALSE)","v":"010536480"},{"$f":"SUM(IF((INDEX(base_indices,1,)=E84)*(INDEX(base_indices,,1)>='Données cumul depuis janvier'!$B$1)*(INDEX(base_indices,,1)<='Données cumul depuis janvier'!$C$1),INDEX(base_indices,,),0))/SUM(IF((INDEX(base_indices,1,)=E84)*(INDEX(base_indices,,1)>='Données cumul depuis janvier'!$D$1)*(INDEX(base_indices,,1)<='Données cumul depuis janvier'!$E$1),INDEX(base_indices,,),0))-1","v":0.44564463383212782},{"$f":"SUM(IF((INDEX(base_indices,1,)=E84)*(INDEX(base_indices,,1)>=$B$3)*(INDEX(base_indices,,1)<=$C$3),INDEX(base_indices,,),0))/SUM(IF((INDEX(base_indices,1,)=E84)*(INDEX(base_indices,,1)>=$D$3)*(INDEX(base_indices,,1)<=$E$3),INDEX(base_indices,,),0))-1","v":0.58393051031487486},null,30,null,{"$f":"SUM(IF((INDEX(base_indices,1,)=E84)*(INDEX(base_indices,,1)='Indice prix'!A$59),INDEX(base_indices,,),0))","v":0}]
[{"$f":"OFFSET('Composition index'!$J$2,0,I85)","v":"Éléments en métal pour la construction"},{"$f":"SUM(IF((INDEX(compo,2,)='Données cumul depuis janvier'!A85)*(INDEX(compo,,1)=$A$52),INDEX(compo,,),0))","v":0},"Éléments en métal pour la construction",0,{"$f":"HLOOKUP(C85,'Composition index'!$A$2:$AR$3,2,FALSE)","v":"010534667"},{"$f":"SUM(IF((INDEX(base_indices,1,)=E85)*(INDEX(base_indices,,1)>='Données cumul depuis janvier'!$B$1)*(INDEX(base_indices,,1)<='Données cumul depuis janvier'!$C$1),INDEX(base_indices,,),0))/SUM(IF((INDEX(base_indices,1,)=E85)*(INDEX(base_indices,,1)>='Données cumul depuis janvier'!$D$1)*(INDEX(base_indices,,1)<='Données cumul depuis janvier'!$E$1),INDEX(base_indices,,),0))-1","v":8.6964705882353055E-2},{"$f":"SUM(IF((INDEX(base_indices,1,)=E85)*(INDEX(base_indices,,1)>=$B$3)*(INDEX(base_indices,,1)<=$C$3),INDEX(base_indices,,),0))/SUM(IF((INDEX(base_indices,1,)=E85)*(INDEX(base_indices,,1)>=$D$3)*(INDEX(base_indices,,1)<=$E$3),INDEX(base_indices,,),0))-1","v":5.8182151365218981E-2},null,31,null,{"$f":"SUM(IF((INDEX(base_indices,1,)=E85)*(INDEX(base_indices,,1)='Indice prix'!A$59),INDEX(base_indices,,),0))","v":0}]
[{"$f":"OFFSET('Composition index'!$J$2,0,I86)","v":"Restaurants et hôtels"},{"$f":"SUM(IF((INDEX(compo,2,)='Données cumul depuis janvier'!A86)*(INDEX(compo,,1)=$A$52),INDEX(compo,,),0))","v":0},"Restaurants et hôtels",0,{"$f":"HLOOKUP(C86,'Composition index'!$A$2:$AR$3,2,FALSE)","v":"001763781"},{"$f":"SUM(IF((INDEX(base_indices,1,)=E86)*(INDEX(base_indices,,1)>='Données cumul depuis janvier'!$B$1)*(INDEX(base_indices,,1)<='Données cumul depuis janvier'!$C$1),INDEX(base_indices,,),0))/SUM(IF((INDEX(base_indices,1,)=E86)*(INDEX(base_indices,,1)>='Données cumul depuis janvier'!$D$1)*(INDEX(base_indices,,1)<='Données cumul depuis janvier'!$E$1),INDEX(base_indices,,),0))-1","v":1.5733124428776613E-2},{"$f":"SUM(IF((INDEX(base_indices,1,)=E86)*(INDEX(base_indices,,1)>=$B$3)*(INDEX(base_indices,,1)<=$C$3),INDEX(base_indices,,),0))/SUM(IF((INDEX(base_indices,1,)=E86)*(INDEX(base_indices,,1)>=$D$3)*(INDEX(base_indices,,1)<=$E$3),INDEX(base_indices,,),0))-1","v":5.7159214730271302E-3},null,32,null,{"$f":"SUM(IF((INDEX(base_indices,1,)=E86)*(INDEX(base_indices,,1)='Indice prix'!A$59),INDEX(base_indices,,),0))","v":0}]
[{"$f":"OFFSET('Composition index'!$J$2,0,I87)","v":"Traitement et élimination des déchets non dangereux"},{"$f":"SUM(IF((INDEX(compo,2,)='Données cumul depuis janvier'!A87)*(INDEX(compo,,1)=$A$52),INDEX(compo,,),0))","v":0},"Traitement et élimination des déchets non dangereux",0,{"$f":"HLOOKUP(C87,'Composition index'!$A$2:$AR$3,2,FALSE)","v":"010534789"},{"$f":"SUM(IF((INDEX(base_indices,1,)=E87)*(INDEX(base_indices,,1)>='Données cumul depuis janvier'!$B$1)*(INDEX(base_indices,,1)<='Données cumul depuis janvier'!$C$1),INDEX(base_indices,,),0))/SUM(IF((INDEX(base_indices,1,)=E87)*(INDEX(base_indices,,1)>='Données cumul depuis janvier'!$D$1)*(INDEX(base_indices,,1)<='Données cumul depuis janvier'!$E$1),INDEX(base_indices,,),0))-1","v":8.5043718361711651E-2},{"$f":"SUM(IF((INDEX(base_indices,1,)=E87)*(INDEX(base_indices,,1)>=$B$3)*(INDEX(base_indices,,1)<=$C$3),INDEX(base_indices,,),0))/SUM(IF((INDEX(base_indices,1,)=E87)*(INDEX(base_indices,,1)>=$D$3)*(INDEX(base_indices,,1)<=$E$3),INDEX(base_indices,,),0))-1","v":5.1931828321584605E-2},null,33,null,{"$f":"SUM(IF((INDEX(base_indices,1,)=E87)*(INDEX(base_indices,,1)='Indice prix'!A$59),INDEX(base_indices,,),0))","v":0}]
[{"$f":"OFFSET('Composition index'!$J$2,0,I88)","v":"Collecte, traitement et élimination des déchets ; récupération de matériaux"},{"$f":"SUM(IF((INDEX(compo,2,)='Données cumul depuis janvier'!A88)*(INDEX(compo,,1)=$A$52),INDEX(compo,,),0))","v":0},"Collecte, traitement et élimination des déchets ; récupération de matériaux",0,{"$f":"HLOOKUP(C88,'Composition index'!$A$2:$AR$3,2,FALSE)","v":"010534784"},{"$f":"SUM(IF((INDEX(base_indices,1,)=E88)*(INDEX(base_indices,,1)>='Données cumul depuis janvier'!$B$1)*(INDEX(base_indices,,1)<='Données cumul depuis janvier'!$C$1),INDEX(base_indices,,),0))/SUM(IF((INDEX(base_indices,1,)=E88)*(INDEX(base_indices,,1)>='Données cumul depuis janvier'!$D$1)*(INDEX(base_indices,,1)<='Données cumul depuis janvier'!$E$1),INDEX(base_indices,,),0))-1","v":0.16406480117820332},{"$f":"SUM(IF((INDEX(base_indices,1,)=E88)*(INDEX(base_indices,,1)>=$B$3)*(INDEX(base_indices,,1)<=$C$3),INDEX(base_indices,,),0))/SUM(IF((INDEX(base_indices,1,)=E88)*(INDEX(base_indices,,1)>=$D$3)*(INDEX(base_indices,,1)<=$E$3),INDEX(base_indices,,),0))-1","v":0.19095931692616785},null,34,null,{"$f":"SUM(IF((INDEX(base_indices,1,)=E88)*(INDEX(base_indices,,1)='Indice prix'!A$59),INDEX(base_indices,,),0))","v":0}]

{"sheet":"Notice d'utilisation Baromètre","index":10,"n_rows":60,"n_cols":2,"rows_kept":60,"cut":false,"hidden":false,"merged":[[47,0,47,3],[49,0,51,1],[52,0,57,1],[59,0,60,1],[38,0,42,1],[43,0,45,1],[1,1,1,2],[7,0,8,3],[20,0,26,1],[30,0,31,1],[34,0,37,1],[13,0,14,3],[11,0,12,3],[4,0,6,3],[16,0,16,3],[28,0,28,3],[18,0,19,1]]}
[]
[null,"NOTICE D'UTILISATION DU BAROMETRE INDEX - INDICES"]
[]
[]
["Dans un contexte de forte volatilité du prix des matières premières, la FNTP met à disposition des FRTP et des Syndicats de spécialités ce baromètre pour objectiver les évolutions des index TP et des indices entrant dans leur composition. Il permet d'avoir une vision claire, simple et partagée des évolutions et tendances de moyen terme et court terme, et sera régulièrement actualisé."]
[]
[]
[{"$f":"\"Point de vigilance : la publication des index et indices est en décalage de 2 à 3 mois - cette édition porte sur les données à fin \"&LOWER('Données à modifier'!A1)","v":"Point de vigilance : la publication des index et indices est en décalage de 2 à 3 mois - cette édition porte sur les données à fin octobre"}]
[]
["Ce baromètre est composé de 3 grandes parties : Evolutions des index / Résultats / Evolutions des indices"]
["Chaque partie fait l'objet de deux onglets distincts : "]
[{"$f":"\"- l'un portant sur les évolutions à moyen terme en comparaison de 2020 (\"&'Données à modifier'!A5&\") et de 2019 (\"&'Données à modifier'!A6&\")\"","v":"- l'un portant sur les évolutions à moyen terme en comparaison de 2020 (Cumul janv 2021-oct 2021 / Cumul janv 2020-oct 2020) et de 2019 (Cumul janv 2021-oct 2021 / Cumul janv 2019-oct 2019)"}]
[]
[{"$f":"\"- l'autre portant sur les évolutions à plus court terme sur 3 mois glissants (\"&'Index 3-6 mois glissants'!H3&\") et 6 mois glissants (\"&'Index 3-6 mois glissants'!H4&\")\"","v":"- l'autre portant sur les évolutions à plus court terme sur 3 mois glissants (Cumul août 2021-oct 2021 / Cumul mai 2021-juil 2021) et 6 mois glissants (Cumul mai 2021-oct 2021 / Cumul nov 2020-avr 2021)"}]
[]
[]
["Evolutions des index : Evol index depuis janvier et Evol index 3-6 mois gissants"]
[]
["Ces deux onglets présentent le classement des 23 index TP selon leurs évolutions (par ordre décroissant) :"]
[]
[{"$f":"\"- par rapport à 2020 (\"&'Données à modifier'!A5&\") + indication de l’évolution par rapport à 2019 (\"&'Données à modifier'!A6&\")\n- en 3 mois glissants (\"&'Index 3-6 mois glissants'!H3&\") + indication de l'évolution en 6 mois glissants (\"&'Index 3-6 mois glissants'!H4&\")\"","v":"- par rapport à 2020 (Cumul janv 2021-oct 2021 / Cumul janv 2020-oct 2020) + indication de l’évolution par rapport à 2019 (Cumul janv 2021-oct 2021 / Cumul janv 2019-oct 2019)\n- en 3 mois glissants (Cumul août 2021-oct 2021 / Cumul mai 2021-juil 2021) + indication de l'évolution en 6 mois glissants (Cumul mai 2021-oct 2021 / Cumul nov 2020-avr 2021)"}]
[]
[]
[]
[]
[]
[]
[]
["Résultats : Résultats depuis janvier et Résultats 3-6 mois glissants"]
[]
["Pour sélectionner l'index qui vous intéresse, il suffit de le selectionner dans la liste déroulante en haut de la page."]
[]
[]
[]
["La partie haute de ces deux onglets présente l'évolution de l'index TP sélectionné dans la liste déroulante en comparaison de l'index TP01. Le graphique de droite présente la composition globale de l'index sélectionné."]
[]
[]
[]
["La partie centrale présente l'évolution des indices communs à la plupart des index TP, en détaillant la part respective de ces indices dans l'index TP sélectionné. Les évolutions des trois postes principaux (Matériel, Travail et GNR) sont représentées sous forme de courbes."]
[]
[]
[]
[]
["La dernière partie présente l'évolution des indices spécifiques à l'index TP sélectionné. Les évolutions des deux postes principaux sont représentées sous forme de courbes."]
[]
[]
[]
["Evolutions des indices : Evol indices depuis janvier et Evol indices 3-6 mois glissants"]
[]
["Ces deux onglets présentent le classement des 41 indices entrant dans la composition des index TP selon leurs évolutions (par ordre décroissant) :"]
[]
[]
[{"$f":"\"- par rapport à 2020 (\"&'Données à modifier'!A5&\") + indication de l’évolution par rapport à 2019 (\"&'Données à modifier'!A6&\")\n- en 3 mois glissants (\"&'Index 3-6 mois glissants'!H3&\") + indication de l'évolution en 6 mois glissants (\"&'Index 3-6 mois glissants'!H4&\")\"","v":"- par rapport à 2020 (Cumul janv 2021-oct 2021 / Cumul janv 2020-oct 2020) + indication de l’évolution par rapport à 2019 (Cumul janv 2021-oct 2021 / Cumul janv 2019-oct 2019)\n- en 3 mois glissants (Cumul août 2021-oct 2021 / Cumul mai 2021-juil 2021) + indication de l'évolution en 6 mois glissants (Cumul mai 2021-oct 2021 / Cumul nov 2020-avr 2021)"}]
[]
[]
[]
[]
[]
[]
["Les indices composant l'index TP choisi dans la liste déroulante de la dernière colonne sont marqués d'une croix"]

{"sheet":"Evol index depuis janvier","index":11,"n_rows":29,"n_cols":4,"rows_kept":29,"cut":false,"hidden":false,"merged":[]}
[{"$f":"\"CLASSEMENT DES INDEX SELON LEUR ÉVOLUTION A FIN \"&'Données à modifier'!A1&\" EN CUMUL DEPUIS JANVIER PAR RAPPORT À 2020\"","v":"CLASSEMENT DES INDEX SELON LEUR ÉVOLUTION A FIN OCTOBRE EN CUMUL DEPUIS JANVIER PAR RAPPORT À 2020"}]
[]
[{"$f":"'Données à modifier'!A3","v":"* /2020 = Cumul janv 2021-oct 2021 / Cumul janv 2020-oct 2020"}]
[{"$f":"'Données à modifier'!A4","v":"* /2019 = Cumul janv 2021-oct 2021 / Cumul janv 2019-oct 2019"}]
[]
[null,null,"/ 2020*","/ 2019*"]
[{"$f":"HYPERLINK('Index depuis janvier'!K8,'Index depuis janvier'!G8)","v":"TP07b"},{"$f":"'Index depuis janvier'!H8","v":"Travaux de génie civil, béton et acier pour ouvrages maritimes"},{"$f":"'Index depuis janvier'!I8","v":0.22052663076002377},{"$f":"'Index depuis janvier'!J8","v":0.15902633074445904}]
[{"$f":"HYPERLINK('Index depuis janvier'!K9,'Index depuis janvier'!G9)","v":"TP13"},{"$f":"'Index depuis janvier'!H9","v":"Charpentes et ouvrages d’art métalliques "},{"$f":"'Index depuis janvier'!I9","v":0.11754068716094035},{"$f":"'Index depuis janvier'!J9","v":0.10189890345012032}]
[{"$f":"HYPERLINK('Index depuis janvier'!K10,'Index depuis janvier'!G10)","v":"TP10c"},{"$f":"'Index depuis janvier'!H10","v":"Réhabilitation de canalisations non visitables"},{"$f":"'Index depuis janvier'!I10","v":0.11555884256263282},{"$f":"'Index depuis janvier'!J10","v":7.8469925820001674E-2}]
[{"$f":"HYPERLINK('Index depuis janvier'!K11,'Index depuis janvier'!G11)","v":"TP09"},{"$f":"'Index depuis janvier'!H11","v":"Fabrication et mise en œuvre d’enrobés "},{"$f":"'Index depuis janvier'!I11","v":7.3470170727028661E-2},{"$f":"'Index depuis janvier'!J11","v":2.3970722781335718E-2}]
[{"$f":"HYPERLINK('Index depuis janvier'!K12,'Index depuis janvier'!G12)","v":"TP06a"},{"$f":"'Index depuis janvier'!H12","v":"Grands dragages maritimes "},{"$f":"'Index depuis janvier'!I12","v":7.2923510089159871E-2},{"$f":"'Index depuis janvier'!J12","v":1.2039660056657242E-2}]
[{"$f":"HYPERLINK('Index depuis janvier'!K13,'Index depuis janvier'!G13)","v":"TP04"},{"$f":"'Index depuis janvier'!H13","v":"Fondations et travaux géotechniques "},{"$f":"'Index depuis janvier'!I13","v":6.691987701211799E-2},{"$f":"'Index depuis janvier'!J13","v":5.4805543138131352E-2}]
[{"$f":"HYPERLINK('Index depuis janvier'!K14,'Index depuis janvier'!G14)","v":"TP02"},{"$f":"'Index depuis janvier'!H14","v":"Travaux de génie civil et d’ouvrages d’art neufs ou rénovation"},{"$f":"'Index depuis janvier'!I14","v":5.3202660133006452E-2},{"$f":"'Index depuis janvier'!J14","v":5.4217395112551303E-2}]
[{"$f":"HYPERLINK('Index depuis janvier'!K15,'Index depuis janvier'!G15)","v":"TP05a"},{"$f":"'Index depuis janvier'!H15","v":"Travaux en souterrains traditionnels "},{"$f":"'Index depuis janvier'!I15","v":4.4619657736761908E-2},{"$f":"'Index depuis janvier'!J15","v":4.387142985047876E-2}]
[{"$f":"HYPERLINK('Index depuis janvier'!K16,'Index depuis janvier'!G16)","v":"TP05b"},{"$f":"'Index depuis janvier'!H16","v":"Travaux en souterrains avec tunnelier "},{"$f":"'Index depuis janvier'!I16","v":4.3985637342908612E-2},{"$f":"'Index depuis janvier'!J16","v":4.3423649739817272E-2}]
[{"$f":"HYPERLINK('Index depuis janvier'!K17,'Index depuis janvier'!G17)","v":"TP08"},{"$f":"'Index depuis janvier'!H17","v":"Travaux d’aménagement et entretien de voirie"},{"$f":"'Index depuis janvier'!I17","v":4.1840229565861309E-2},{"$f":"'Index depuis janvier'!J17","v":2.3460943893789166E-2}]
[{"$f":"HYPERLINK('Index depuis janvier'!K18,'Index depuis janvier'!G18)","v":"TP01"},{"$f":"'Index depuis janvier'!H18","v":"Index général tous travaux"},{"$f":"'Index depuis janvier'!I18","v":4.137115839243477E-2},{"$f":"'Index depuis janvier'!J18","v":3.0316660669305495E-2}]
[{"$f":"HYPERLINK('Index depuis janvier'!K19,'Index depuis janvier'!G19)","v":"TP11"},{"$f":"'Index depuis janvier'!H19","v":"Canalisations grandes distances de transport / transfert  avec fourniture de tuyaux"},{"$f":"'Index depuis janvier'!I19","v":4.0271666347809321E-2},{"$f":"'Index depuis janvier'!J19","v":3.2567413596658046E-2}]
[{"$f":"HYPERLINK('Index depuis janvier'!K20,'Index depuis janvier'!G20)","v":"TP10d"},{"$f":"'Index depuis janvier'!H20","v":"Réseaux de chauffage et de froid avec fourniture de tuyaux"},{"$f":"'Index depuis janvier'!I20","v":3.3361847733105021E-2},{"$f":"'Index depuis janvier'!J20","v":"-"}]
[{"$f":"HYPERLINK('Index depuis janvier'!K21,'Index depuis janvier'!G21)","v":"TP12b"},{"$f":"'Index depuis janvier'!H21","v":"Éclairage public -Travaux d'installation"},{"$f":"'Index depuis janvier'!I21","v":3.212368079985195E-2},{"$f":"'Index depuis janvier'!J21","v":2.3031748944760677E-2}]
[{"$f":"HYPERLINK('Index depuis janvier'!K22,'Index depuis janvier'!G22)","v":"TP10a"},{"$f":"'Index depuis janvier'!H22","v":"Canalisations, assainissement et adduction d’eau avec fourniture de tuyaux "},{"$f":"'Index depuis janvier'!I22","v":3.04889049251309E-2},{"$f":"'Index depuis janvier'!J22","v":3.0767842641884036E-2}]
[{"$f":"HYPERLINK('Index depuis janvier'!K23,'Index depuis janvier'!G23)","v":"TP06b"},{"$f":"'Index depuis janvier'!H23","v":"Dragages fluviaux et petits dragages maritimes"},{"$f":"'Index depuis janvier'!I23","v":3.0478143349799369E-2},{"$f":"'Index depuis janvier'!J23","v":1.2176142085507324E-2}]
[{"$f":"HYPERLINK('Index depuis janvier'!K24,'Index depuis janvier'!G24)","v":"TP03a"},{"$f":"'Index depuis janvier'!H24","v":"Grands terrassements"},{"$f":"'Index depuis janvier'!I24","v":2.7904431880357627E-2},{"$f":"'Index depuis janvier'!J24","v":1.999819020903093E-2}]
[{"$f":"HYPERLINK('Index depuis janvier'!K25,'Index depuis janvier'!G25)","v":"TP12a"},{"$f":"'Index depuis janvier'!H25","v":"Réseaux d'énergie et de communication"},{"$f":"'Index depuis janvier'!I25","v":2.5311942959001854E-2},{"$f":"'Index depuis janvier'!J25","v":2.9809327723569812E-2}]
[{"$f":"HYPERLINK('Index depuis janvier'!K26,'Index depuis janvier'!G26)","v":"TP10b"},{"$f":"'Index depuis janvier'!H26","v":"Canalisations sans fourniture de tuyaux"},{"$f":"'Index depuis janvier'!I26","v":2.1374315491962559E-2},{"$f":"'Index depuis janvier'!J26","v":2.2186864668965134E-2}]
[{"$f":"HYPERLINK('Index depuis janvier'!K27,'Index depuis janvier'!G27)","v":"TP03b"},{"$f":"'Index depuis janvier'!H27","v":"Travaux à l’explosif"},{"$f":"'Index depuis janvier'!I27","v":1.8384401114206028E-2},{"$f":"'Index depuis janvier'!J27","v":1.2368469632637824E-2}]
[{"$f":"HYPERLINK('Index depuis janvier'!K28,'Index depuis janvier'!G28)","v":"TP14"},{"$f":"'Index depuis janvier'!H28","v":"Travaux immergés par scaphandriers"},{"$f":"'Index depuis janvier'!I28","v":1.092611862643067E-2},{"$f":"'Index depuis janvier'!J28","v":1.4003653126902327E-2}]
[{"$f":"HYPERLINK('Index depuis janvier'!K29,'Index depuis janvier'!G29)","v":"TP12c"},{"$f":"'Index depuis janvier'!H29","v":"Éclairage public - Travaux  de maintenance"},{"$f":"'Index depuis janvier'!I29","v":4.7182175622542122E-3},{"$f":"'Index depuis janvier'!J29","v":8.7726993595929059E-3}]
[{"$f":"HYPERLINK('Index depuis janvier'!K30,'Index depuis janvier'!G30)","v":"TP12d"},{"$f":"'Index depuis janvier'!H30","v":"Réseaux de communication en fibre optique"},{"$f":"'Index depuis janvier'!I30","v":3.4710170079834679E-3},{"$f":"'Index depuis janvier'!J30","v":9.6917838121017841E-3}]

{"sheet":"Evol index 3-6 mois glissants","index":12,"n_rows":29,"n_cols":4,"rows_kept":29,"cut":false,"hidden":false,"merged":[]}
["CLASSEMENT DES INDEX SELON LEUR ÉVOLUTION SUR 3 MOIS GLISSANTS"]
[]
[{"$f":"'Index 3-6 mois glissants'!H1","v":"* 3 mois = août 2021-oct 2021 / mai 2021-juil 2021"}]
[{"$f":"'Index 3-6 mois glissants'!H2","v":"* 6 mois = mai 2021-oct 2021 / nov 2020-avr 2021"}]
[]
[null,null,"3 mois*","6 mois*"]
[{"$f":"HYPERLINK('Index 3-6 mois glissants'!K8,'Index 3-6 mois glissants'!G8)","v":"TP13"},{"$f":"'Index 3-6 mois glissants'!H8","v":"Charpentes et ouvrages d’art métalliques "},{"$f":"'Index 3-6 mois glissants'!I8","v":0.12454823463997755},{"$f":"'Index 3-6 mois glissants'!J8","v":0.10242354298903655}]
[{"$f":"HYPERLINK('Index 3-6 mois glissants'!K9,'Index 3-6 mois glissants'!G9)","v":"TP07b"},{"$f":"'Index 3-6 mois glissants'!H9","v":"Travaux de génie civil, béton et acier pour ouvrages maritimes"},{"$f":"'Index 3-6 mois glissants'!I9","v":9.6521973577784026E-2},{"$f":"'Index 3-6 mois glissants'!J9","v":0.19925971622455285}]
[{"$f":"HYPERLINK('Index 3-6 mois glissants'!K10,'Index 3-6 mois glissants'!G10)","v":"TP09"},{"$f":"'Index 3-6 mois glissants'!H10","v":"Fabrication et mise en œuvre d’enrobés "},{"$f":"'Index 3-6 mois glissants'!I10","v":2.8503562945368044E-2},{"$f":"'Index 3-6 mois glissants'!J10","v":6.5834633385335461E-2}]
[{"$f":"HYPERLINK('Index 3-6 mois glissants'!K11,'Index 3-6 mois glissants'!G11)","v":"TP04"},{"$f":"'Index 3-6 mois glissants'!H11","v":"Fondations et travaux géotechniques "},{"$f":"'Index 3-6 mois glissants'!I11","v":2.2771998875456889E-2},{"$f":"'Index 3-6 mois glissants'!J11","v":5.452147149347808E-2}]
[{"$f":"HYPERLINK('Index 3-6 mois glissants'!K12,'Index 3-6 mois glissants'!G12)","v":"TP06a"},{"$f":"'Index 3-6 mois glissants'!H12","v":"Grands dragages maritimes "},{"$f":"'Index 3-6 mois glissants'!I12","v":2.2416302765647655E-2},{"$f":"'Index 3-6 mois glissants'!J12","v":4.5133142771174972E-2}]
[{"$f":"HYPERLINK('Index 3-6 mois glissants'!K13,'Index 3-6 mois glissants'!G13)","v":"TP02"},{"$f":"'Index 3-6 mois glissants'!H13","v":"Travaux de génie civil et d’ouvrages d’art neufs ou rénovation"},{"$f":"'Index 3-6 mois glissants'!I13","v":2.1793103448275897E-2},{"$f":"'Index 3-6 mois glissants'!J13","v":4.6850449935723626E-2}]
[{"$f":"HYPERLINK('Index 3-6 mois glissants'!K14,'Index 3-6 mois glissants'!G14)","v":"TP11"},{"$f":"'Index 3-6 mois glissants'!H14","v":"Canalisations grandes distances de transport / transfert  avec fourniture de tuyaux"},{"$f":"'Index 3-6 mois glissants'!I14","v":2.0788749617853819E-2},{"$f":"'Index 3-6 mois glissants'!J14","v":4.0289581366068639E-2}]
[{"$f":"HYPERLINK('Index 3-6 mois glissants'!K15,'Index 3-6 mois glissants'!G15)","v":"TP08"},{"$f":"'Index 3-6 mois glissants'!H15","v":"Travaux d’aménagement et entretien de voirie"},{"$f":"'Index 3-6 mois glissants'!I15","v":1.6843971631205878E-2},{"$f":"'Index 3-6 mois glissants'!J15","v":3.833865814696491E-2}]
[{"$f":"HYPERLINK('Index 3-6 mois glissants'!K16,'Index 3-6 mois glissants'!G16)","v":"TP01"},{"$f":"'Index 3-6 mois glissants'!H16","v":"Index général tous travaux"},{"$f":"'Index 3-6 mois glissants'!I16","v":1.5375689004931692E-2},{"$f":"'Index 3-6 mois glissants'!J16","v":3.7020450813554318E-2}]
[{"$f":"HYPERLINK('Index 3-6 mois glissants'!K17,'Index 3-6 mois glissants'!G17)","v":"TP05a"},{"$f":"'Index 3-6 mois glissants'!H17","v":"Travaux en souterrains traditionnels "},{"$f":"'Index 3-6 mois glissants'!I17","v":1.4827487881380108E-2},{"$f":"'Index 3-6 mois glissants'!J17","v":3.409922435240742E-2}]
[{"$f":"HYPERLINK('Index 3-6 mois glissants'!K18,'Index 3-6 mois glissants'!G18)","v":"TP05b"},{"$f":"'Index 3-6 mois glissants'!H18","v":"Travaux en souterrains avec tunnelier "},{"$f":"'Index 3-6 mois glissants'!I18","v":1.3737836290784289E-2},{"$f":"'Index 3-6 mois glissants'!J18","v":3.0161054172767043E-2}]
[{"$f":"HYPERLINK('Index 3-6 mois glissants'!K19,'Index 3-6 mois glissants'!G19)","v":"TP10a"},{"$f":"'Index 3-6 mois glissants'!H19","v":"Canalisations, assainissement et adduction d’eau avec fourniture de tuyaux "},{"$f":"'Index 3-6 mois glissants'!I19","v":1.2779552715654896E-2},{"$f":"'Index 3-6 mois glissants'!J19","v":3.3711217183771014E-2}]
[{"$f":"HYPERLINK('Index 3-6 mois glissants'!K20,'Index 3-6 mois glissants'!G20)","v":"TP12a"},{"$f":"'Index 3-6 mois glissants'!H20","v":"Réseaux d'énergie et de communication"},{"$f":"'Index 3-6 mois glissants'!I20","v":1.0398613518197708E-2},{"$f":"'Index 3-6 mois glissants'!J20","v":2.5641025641025772E-2}]
[{"$f":"HYPERLINK('Index 3-6 mois glissants'!K21,'Index 3-6 mois glissants'!G21)","v":"TP12b"},{"$f":"'Index 3-6 mois glissants'!H21","v":"Éclairage public -Travaux d'installation"},{"$f":"'Index 3-6 mois glissants'!I21","v":1.012206013694561E-2},{"$f":"'Index 3-6 mois glissants'!J21","v":2.7701674277016863E-2}]
[{"$f":"HYPERLINK('Index 3-6 mois glissants'!K22,'Index 3-6 mois glissants'!G22)","v":"TP06b"},{"$f":"'Index 3-6 mois glissants'!H22","v":"Dragages fluviaux et petits dragages maritimes"},{"$f":"'Index 3-6 mois glissants'!I22","v":9.3233082706767334E-3},{"$f":"'Index 3-6 mois glissants'!J22","v":2.4850437183616902E-2}]
[{"$f":"HYPERLINK('Index 3-6 mois glissants'!K23,'Index 3-6 mois glissants'!G23)","v":"TP03a"},{"$f":"'Index 3-6 mois glissants'!H23","v":"Grands terrassements"},{"$f":"'Index 3-6 mois glissants'!I23","v":8.2620241959281415E-3},{"$f":"'Index 3-6 mois glissants'!J23","v":2.284340246468286E-2}]
[{"$f":"HYPERLINK('Index 3-6 mois glissants'!K24,'Index 3-6 mois glissants'!G24)","v":"TP10d"},{"$f":"'Index 3-6 mois glissants'!H24","v":"Réseaux de chauffage et de froid avec fourniture de tuyaux"},{"$f":"'Index 3-6 mois glissants'!I24","v":7.9486395597676562E-3},{"$f":"'Index 3-6 mois glissants'!J24","v":2.4169655387494382E-2}]
[{"$f":"HYPERLINK('Index 3-6 mois glissants'!K25,'Index 3-6 mois glissants'!G25)","v":"TP14"},{"$f":"'Index 3-6 mois glissants'!H25","v":"Travaux immergés par scaphandriers"},{"$f":"'Index 3-6 mois glissants'!I25","v":5.1413881748070267E-3},{"$f":"'Index 3-6 mois glissants'!J25","v":1.1818968002306418E-2}]
[{"$f":"HYPERLINK('Index 3-6 mois glissants'!K26,'Index 3-6 mois glissants'!G26)","v":"TP03b"},{"$f":"'Index 3-6 mois glissants'!H26","v":"Travaux à l’explosif"},{"$f":"'Index 3-6 mois glissants'!I26","v":4.8455481526348265E-3},{"$f":"'Index 3-6 mois glissants'!J26","v":1.7365913631473884E-2}]
[{"$f":"HYPERLINK('Index 3-6 mois glissants'!K27,'Index 3-6 mois glissants'!G27)","v":"TP10b"},{"$f":"'Index 3-6 mois glissants'!H27","v":"Canalisations sans fourniture de tuyaux"},{"$f":"'Index 3-6 mois glissants'!I27","v":2.0120724346077701E-3},{"$f":"'Index 3-6 mois glissants'!J27","v":1.5158140212796933E-2}]
[{"$f":"HYPERLINK('Index 3-6 mois glissants'!K28,'Index 3-6 mois glissants'!G28)","v":"TP10c"},{"$f":"'Index 3-6 mois glissants'!H28","v":"Réhabilitation de canalisations non visitables"},{"$f":"'Index 3-6 mois glissants'!I28","v":-1.6168148746968924E-3},{"$f":"'Index 3-6 mois glissants'!J28","v":8.4686265906099178E-2}]
[{"$f":"HYPERLINK('Index 3-6 mois glissants'!K29,'Index 3-6 mois glissants'!G29)","v":"TP12c"},{"$f":"'Index 3-6 mois glissants'!H29","v":"Éclairage public - Travaux  de maintenance"},{"$f":"'Index 3-6 mois glissants'!I29","v":-2.3141452126119733E-3},{"$f":"'Index 3-6 mois glissants'!J29","v":3.1958163858221145E-3}]
[{"$f":"HYPERLINK('Index 3-6 mois glissants'!K30,'Index 3-6 mois glissants'!G30)","v":"TP12d"},{"$f":"'Index 3-6 mois glissants'!H30","v":"Réseaux de communication en fibre optique"},{"$f":"'Index 3-6 mois glissants'!I30","v":-2.5936599423630469E-3},{"$f":"'Index 3-6 mois glissants'!J30","v":-1.2968299711815234E-3}]

{"sheet":"Indices depuis janvier","index":13,"n_rows":45,"n_cols":14,"rows_kept":45,"cut":false,"hidden":true,"merged":[]}
[null,"www.fntp.fr/sites/default/files/content/indice_fioul_lourd.pdf",null,"2021-01-01",{"$f":"DATE(2021,MONTH(date),1)","v":"2021-10-01"},"2019-01-01",{"$f":"DATE(2019,MONTH(date),1)","v":"2019-10-01"}]
[null,null,null,"2021-01-01",{"$f":"DATE(2021,MONTH(date),1)","v":"2021-10-01"},"2020-01-01",{"$f":"DATE(2020,MONTH(date),1)","v":"2020-10-01"}]
[]
[null,null,null,"/ 2020","/ 2019"]
[{"$f":"OFFSET('Indice prix'!$B$2,0,$G5)","v":"001711009"},{"$f":"OFFSET('Indice prix'!$B$5,0,$G5)","v":"Matériel"},{"$f":"OFFSET('Indice prix'!$B$4,0,$G5)","v":"https://www.insee.fr/fr/statistiques/serie/001711009"},{"$f":"SUM(IF((INDEX(base_indices,1,)=$A5)*(INDEX(base_indices,,1)>=$D$2)*(INDEX(base_indices,,1)<=$E$2),INDEX(base_indices,,),0))/SUM(IF((INDEX(base_indices,1,)=$A5)*(INDEX(base_indices,,1)>=$F$2)*(INDEX(base_indices,,1)<=$G$2),INDEX(base_indices,,),0))-1","v":2.9439969313387104E-2},{"$f":"SUM(IF((INDEX(base_indices,1,)=$A5)*(INDEX(base_indices,,1)>=$D$1)*(INDEX(base_indices,,1)<=$E$1),INDEX(base_indices,,),0))/SUM(IF((INDEX(base_indices,1,)=$A5)*(INDEX(base_indices,,1)>=$F$1)*(INDEX(base_indices,,1)<=$G$1),INDEX(base_indices,,),0))-1","v":2.0728344584957537E-2},null,0,null,{"$f":"_xlfn._xlws.SORT('Indices depuis janvier'!$A$5:$E$45,4,-1)","v":"010536480"},"Tôles quarto et autres produits plats en aciers non alliés de qualité","https://www.insee.fr/fr/statistiques/serie/010536480",0.58393051031487486,0.44564463383212782,{"$f":"IF(SUM(IF((INDEX(compo,3,)=I5)*(INDEX(compo,,1)='Evol indices depuis janvier'!$D$7),INDEX(compo,,),0))>0,\"x\",\"\")","v":""}]
[{"$f":"OFFSET('Indice prix'!$B$2,0,$G6)","v":"5540998"},{"$f":"OFFSET('Indice prix'!$B$5,0,$G6)","v":"Travail"},{"$f":"OFFSET('Indice prix'!$B$4,0,$G6)","v":"https://www.insee.fr/fr/statistiques/6020697"},{"$f":"SUM(IF((INDEX(base_indices,1,)=$A6)*(INDEX(base_indices,,1)>=$D$2)*(INDEX(base_indices,,1)<=$E$2),INDEX(base_indices,,),0))/SUM(IF((INDEX(base_indices,1,)=$A6)*(INDEX(base_indices,,1)>=$F$2)*(INDEX(base_indices,,1)<=$G$2),INDEX(base_indices,,),0))-1","v":-6.3081277800242086E-3},{"$f":"SUM(IF((INDEX(base_indices,1,)=$A6)*(INDEX(base_indices,,1)>=$D$1)*(INDEX(base_indices,,1)<=$E$1),INDEX(base_indices,,),0))/SUM(IF((INDEX(base_indices,1,)=$A6)*(INDEX(base_indices,,1)>=$F$1)*(INDEX(base_indices,,1)<=$G$1),INDEX(base_indices,,),0))-1","v":3.4299714169048201E-3},null,1,null,"010546545","Barres crénelées ou nervurées pour béton armé","https://www.insee.fr/fr/statistiques/serie/010546545",0.49380706988518241,0.36126215191959177,{"$f":"IF(SUM(IF((INDEX(compo,3,)=I6)*(INDEX(compo,,1)='Evol indices depuis janvier'!$D$7),INDEX(compo,,),0))>0,\"x\",\"\")","v":"x"}]
[{"$f":"OFFSET('Indice prix'!$B$2,0,$G7)","v":"001565195"},{"$f":"OFFSET('Indice prix'!$B$5,0,$G7)","v":"Travail activités spécialisées"},{"$f":"OFFSET('Indice prix'!$B$4,0,$G7)","v":"https://www.insee.fr/fr/statistiques/serie/001565195"},{"$f":"SUM(IF((INDEX(base_indices,1,)=$A7)*(INDEX(base_indices,,1)>=$D$2)*(INDEX(base_indices,,1)<=$E$2),INDEX(base_indices,,),0))/SUM(IF((INDEX(base_indices,1,)=$A7)*(INDEX(base_indices,,1)>=$F$2)*(INDEX(base_indices,,1)<=$G$2),INDEX(base_indices,,),0))-1","v":1.5477072528196301E-2},{"$f":"SUM(IF((INDEX(base_indices,1,)=$A7)*(INDEX(base_indices,,1)>=$D$1)*(INDEX(base_indices,,1)<=$E$1),INDEX(base_indices,,),0))/SUM(IF((INDEX(base_indices,1,)=$A7)*(INDEX(base_indices,,1)>=$F$1)*(INDEX(base_indices,,1)<=$G$1),INDEX(base_indices,,),0))-1","v":3.3082077051926229E-2},null,2,null,"010536462","Acier pour la construction","https://www.insee.fr/fr/statistiques/serie/010536462",0.47459340255444271,0.34676065793890554,{"$f":"IF(SUM(IF((INDEX(compo,3,)=I7)*(INDEX(compo,,1)='Evol indices depuis janvier'!$D$7),INDEX(compo,,),0))>0,\"x\",\"\")","v":""}]
[{"$f":"OFFSET('Indice prix'!$B$2,0,$G8)","v":"010534596"},{"$f":"OFFSET('Indice prix'!$B$5,0,$G8)","v":"GNR"},{"$f":"OFFSET('Indice prix'!$B$4,0,$G8)","v":"https://www.insee.fr/fr/statistiques/serie/010534596"},{"$f":"SUM(IF((INDEX(base_indices,1,)=$A8)*(INDEX(base_indices,,1)>=$D$2)*(INDEX(base_indices,,1)<=$E$2),INDEX(base_indices,,),0))/SUM(IF((INDEX(base_indices,1,)=$A8)*(INDEX(base_indices,,1)>=$F$2)*(INDEX(base_indices,,1)<=$G$2),INDEX(base_indices,,),0))-1","v":0.16641664166416636},{"$f":"SUM(IF((INDEX(base_indices,1,)=$A8)*(INDEX(base_indices,,1)>=$D$1)*(INDEX(base_indices,,1)<=$E$1),INDEX(base_indices,,),0))/SUM(IF((INDEX(base_indices,1,)=$A8)*(INDEX(base_indices,,1)>=$F$1)*(INDEX(base_indices,,1)<=$G$1),INDEX(base_indices,,),0))-1","v":-4.6673205819846464E-2},null,3,null,"010534606","Matières plastiques sous formes primaires","https://www.insee.fr/fr/statistiques/serie/010534606",0.41793830277747301,0.24695887236918335,{"$f":"IF(SUM(IF((INDEX(compo,3,)=I8)*(INDEX(compo,,1)='Evol indices depuis janvier'!$D$7),INDEX(compo,,),0))>0,\"x\",\"\")","v":""}]
[{"$f":"OFFSET('Indice prix'!$B$2,0,$G9)","v":"001764283"},{"$f":"OFFSET('Indice prix'!$B$5,0,$G9)","v":"Gazole"},{"$f":"OFFSET('Indice prix'!$B$4,0,$G9)","v":"https://www.insee.fr/fr/statistiques/serie/001764283"},{"$f":"SUM(IF((INDEX(base_indices,1,)=$A9)*(INDEX(base_indices,,1)>=$D$2)*(INDEX(base_indices,,1)<=$E$2),INDEX(base_indices,,),0))/SUM(IF((INDEX(base_indices,1,)=$A9)*(INDEX(base_indices,,1)>=$F$2)*(INDEX(base_indices,,1)<=$G$2),INDEX(base_indices,,),0))-1","v":0.10335912591469243},{"$f":"SUM(IF((INDEX(base_indices,1,)=$A9)*(INDEX(base_indices,,1)>=$D$1)*(INDEX(base_indices,,1)<=$E$1),INDEX(base_indices,,),0))/SUM(IF((INDEX(base_indices,1,)=$A9)*(INDEX(base_indices,,1)>=$F$1)*(INDEX(base_indices,,1)<=$G$1),INDEX(base_indices,,),0))-1","v":-3.0775527236542199E-2},null,4,null,"Gazole routier HTT","Gazole routier HTT","https://www.fntp.fr/sites/default/files/content/indice_gazole_htt.pdf",0.35283028274210348,-0.15005089240728497,{"$f":"IF(SUM(IF((INDEX(compo,3,)=I9)*(INDEX(compo,,1)='Evol indices depuis janvier'!$D$7),INDEX(compo,,),0))>0,\"x\",\"\")","v":""}]
[{"$f":"OFFSET('Indice prix'!$B$2,0,$G10)","v":"001711011"},{"$f":"OFFSET('Indice prix'!$B$5,0,$G10)","v":"Frais divers"},{"$f":"OFFSET('Indice prix'!$B$4,0,$G10)","v":"https://www.insee.fr/fr/statistiques/serie/001711011"},{"$f":"SUM(IF((INDEX(base_indices,1,)=$A10)*(INDEX(base_indices,,1)>=$D$2)*(INDEX(base_indices,,1)<=$E$2),INDEX(base_indices,,),0))/SUM(IF((INDEX(base_indices,1,)=$A10)*(INDEX(base_indices,,1)>=$F$2)*(INDEX(base_indices,,1)<=$G$2),INDEX(base_indices,,),0))-1","v":1.2368344767610395E-2},{"$f":"SUM(IF((INDEX(base_indices,1,)=$A10)*(INDEX(base_indices,,1)>=$D$1)*(INDEX(base_indices,,1)<=$E$1),INDEX(base_indices,,),0))/SUM(IF((INDEX(base_indices,1,)=$A10)*(INDEX(base_indices,,1)>=$F$1)*(INDEX(base_indices,,1)<=$G$1),INDEX(base_indices,,),0))-1","v":1.3347519102427929E-2},null,5,null,"Fioul lourd","Fioul lourd","https://www.fntp.fr/sites/default/files/content/indice_fioul_lourd.pdf",0.34776709988821985,-0.15323196234867797,{"$f":"IF(SUM(IF((INDEX(compo,3,)=I10)*(INDEX(compo,,1)='Evol indices depuis janvier'!$D$7),INDEX(compo,,),0))>0,\"x\",\"\")","v":""}]
[{"$f":"OFFSET('Indice prix'!$B$2,0,$G11)","v":"001711943"},{"$f":"OFFSET('Indice prix'!$B$5,0,$G11)","v":"Transports routiers"},{"$f":"OFFSET('Indice prix'!$B$4,0,$G11)","v":"https://www.insee.fr/fr/statistiques/serie/001711943"},{"$f":"SUM(IF((INDEX(base_indices,1,)=$A11)*(INDEX(base_indices,,1)>=$D$2)*(INDEX(base_indices,,1)<=$E$2),INDEX(base_indices,,),0))/SUM(IF((INDEX(base_indices,1,)=$A11)*(INDEX(base_indices,,1)>=$F$2)*(INDEX(base_indices,,1)<=$G$2),INDEX(base_indices,,),0))-1","v":3.2867707477404196E-3},{"$f":"SUM(IF((INDEX(base_indices,1,)=$A11)*(INDEX(base_indices,,1)>=$D$1)*(INDEX(base_indices,,1)<=$E$1),INDEX(base_indices,,),0))/SUM(IF((INDEX(base_indices,1,)=$A11)*(INDEX(base_indices,,1)>=$F$1)*(INDEX(base_indices,,1)<=$G$1),INDEX(base_indices,,),0))-1","v":4.5708017186214533E-3},null,6,null,"010534267","Produits sidérurgiques en acier non allié","https://www.insee.fr/fr/statistiques/serie/010534267",0.26905999055266894,0.18081926863572417,{"$f":"IF(SUM(IF((INDEX(compo,3,)=I11)*(INDEX(compo,,1)='Evol indices depuis janvier'!$D$7),INDEX(compo,,),0))>0,\"x\",\"\")","v":""}]
[{"$f":"OFFSET('Indice prix'!$B$2,0,$G12)","v":"010534769"},{"$f":"OFFSET('Indice prix'!$B$5,0,$G12)","v":"Électricité vendue aux entreprises consommatrices finales"},{"$f":"OFFSET('Indice prix'!$B$4,0,$G12)","v":"https://www.insee.fr/fr/statistiques/serie/010534769"},{"$f":"SUM(IF((INDEX(base_indices,1,)=$A12)*(INDEX(base_indices,,1)>=$D$2)*(INDEX(base_indices,,1)<=$E$2),INDEX(base_indices,,),0))/SUM(IF((INDEX(base_indices,1,)=$A12)*(INDEX(base_indices,,1)>=$F$2)*(INDEX(base_indices,,1)<=$G$2),INDEX(base_indices,,),0))-1","v":3.987677562895775E-2},{"$f":"SUM(IF((INDEX(base_indices,1,)=$A12)*(INDEX(base_indices,,1)>=$D$1)*(INDEX(base_indices,,1)<=$E$1),INDEX(base_indices,,),0))/SUM(IF((INDEX(base_indices,1,)=$A12)*(INDEX(base_indices,,1)>=$F$1)*(INDEX(base_indices,,1)<=$G$1),INDEX(base_indices,,),0))-1","v":8.3452211126961551E-2},null,7,null,"010534784","Collecte, traitement et élimination des déchets ; récupération de matériaux","https://www.insee.fr/fr/statistiques/serie/010534784",0.19095931692616785,0.16406480117820332,{"$f":"IF(SUM(IF((INDEX(compo,3,)=I12)*(INDEX(compo,,1)='Evol indices depuis janvier'!$D$7),INDEX(compo,,),0))>0,\"x\",\"\")","v":""}]
[{"$f":"OFFSET('Indice prix'!$B$2,0,$G13)","v":"Fioul lourd"},{"$f":"OFFSET('Indice prix'!$B$5,0,$G13)","v":"Fioul lourd"},{"$f":"OFFSET('Indice prix'!$B$4,0,$G13)","v":"https://www.fntp.fr/sites/default/files/content/indice_fioul_lourd.pdf"},{"$f":"SUM(IF((INDEX(base_indices,1,)=$A13)*(INDEX(base_indices,,1)>=$D$2)*(INDEX(base_indices,,1)<=$E$2),INDEX(base_indices,,),0))/SUM(IF((INDEX(base_indices,1,)=$A13)*(INDEX(base_indices,,1)>=$F$2)*(INDEX(base_indices,,1)<=$G$2),INDEX(base_indices,,),0))-1","v":0.34776709988821985},{"$f":"SUM(IF((INDEX(base_indices,1,)=$A13)*(INDEX(base_indices,,1)>=$D$1)*(INDEX(base_indices,,1)<=$E$1),INDEX(base_indices,,),0))/SUM(IF((INDEX(base_indices,1,)=$A13)*(INDEX(base_indices,,1)>=$F$1)*(INDEX(base_indices,,1)<=$G$1),INDEX(base_indices,,),0))-1","v":-0.15323196234867797},null,8,null,"010534330","Fils et câbles d'énergie","https://www.insee.fr/fr/statistiques/serie/010534330",0.18786096818229558,0.17735220649458738,{"$f":"IF(SUM(IF((INDEX(compo,3,)=I13)*(INDEX(compo,,1)='Evol indices depuis janvier'!$D$7),INDEX(compo,,),0))>0,\"x\",\"\")","v":""}]
[{"$f":"OFFSET('Indice prix'!$B$2,0,$G14)","v":"Gazole routier HTT"},{"$f":"OFFSET('Indice prix'!$B$5,0,$G14)","v":"Gazole routier HTT"},{"$f":"OFFSET('Indice prix'!$B$4,0,$G14)","v":"https://www.fntp.fr/sites/default/files/content/indice_gazole_htt.pdf"},{"$f":"SUM(IF((INDEX(base_indices,1,)=$A14)*(INDEX(base_indices,,1)>=$D$2)*(INDEX(base_indices,,1)<=$E$2),INDEX(base_indices,,),0))/SUM(IF((INDEX(base_indices,1,)=$A14)*(INDEX(base_indices,,1)>=$F$2)*(INDEX(base_indices,,1)<=$G$2),INDEX(base_indices,,),0))-1","v":0.35283028274210348},{"$f":"SUM(IF((INDEX(base_indices,1,)=$A14)*(INDEX(base_indices,,1)>=$D$1)*(INDEX(base_indices,,1)<=$E$1),INDEX(base_indices,,),0))/SUM(IF((INDEX(base_indices,1,)=$A14)*(INDEX(base_indices,,1)>=$F$1)*(INDEX(base_indices,,1)<=$G$1),INDEX(base_indices,,),0))-1","v":-0.15005089240728497},null,9,null,"010534575","Ensemble des produits du sciage","https://www.insee.fr/fr/statistiques/serie/010534575",0.17970283151107402,0.15890939135224502,{"$f":"IF(SUM(IF((INDEX(compo,3,)=I14)*(INDEX(compo,,1)='Evol indices depuis janvier'!$D$7),INDEX(compo,,),0))>0,\"x\",\"\")","v":"x"}]
[{"$f":"OFFSET('Indice prix'!$B$2,0,$G15)","v":"010534207"},{"$f":"OFFSET('Indice prix'!$B$5,0,$G15)","v":"Tubes, tuyaux en matière plastique"},{"$f":"OFFSET('Indice prix'!$B$4,0,$G15)","v":"https://www.insee.fr/fr/statistiques/serie/010534207"},{"$f":"SUM(IF((INDEX(base_indices,1,)=$A15)*(INDEX(base_indices,,1)>=$D$2)*(INDEX(base_indices,,1)<=$E$2),INDEX(base_indices,,),0))/SUM(IF((INDEX(base_indices,1,)=$A15)*(INDEX(base_indices,,1)>=$F$2)*(INDEX(base_indices,,1)<=$G$2),INDEX(base_indices,,),0))-1","v":0.12234255916566394},{"$f":"SUM(IF((INDEX(base_indices,1,)=$A15)*(INDEX(base_indices,,1)>=$D$1)*(INDEX(base_indices,,1)<=$E$1),INDEX(base_indices,,),0))/SUM(IF((INDEX(base_indices,1,)=$A15)*(INDEX(base_indices,,1)>=$F$1)*(INDEX(base_indices,,1)<=$G$1),INDEX(base_indices,,),0))-1","v":0.11908809119088093},null,10,null,"010534598","Bitume","https://www.insee.fr/fr/statistiques/serie/010534598",0.1784524250277677,6.0575769692123194E-2,{"$f":"IF(SUM(IF((INDEX(compo,3,)=I15)*(INDEX(compo,,1)='Evol indices depuis janvier'!$D$7),INDEX(compo,,),0))>0,\"x\",\"\")","v":""}]
[{"$f":"OFFSET('Indice prix'!$B$2,0,$G16)","v":"010534575"},{"$f":"OFFSET('Indice prix'!$B$5,0,$G16)","v":"Ensemble des produits du sciage"},{"$f":"OFFSET('Indice prix'!$B$4,0,$G16)","v":"https://www.insee.fr/fr/statistiques/serie/010534575"},{"$f":"SUM(IF((INDEX(base_indices,1,)=$A16)*(INDEX(base_indices,,1)>=$D$2)*(INDEX(base_indices,,1)<=$E$2),INDEX(base_indices,,),0))/SUM(IF((INDEX(base_indices,1,)=$A16)*(INDEX(base_indices,,1)>=$F$2)*(INDEX(base_indices,,1)<=$G$2),INDEX(base_indices,,),0))-1","v":0.17970283151107402},{"$f":"SUM(IF((INDEX(base_indices,1,)=$A16)*(INDEX(base_indices,,1)>=$D$1)*(INDEX(base_indices,,1)<=$E$1),INDEX(base_indices,,),0))/SUM(IF((INDEX(base_indices,1,)=$A16)*(INDEX(base_indices,,1)>=$F$1)*(INDEX(base_indices,,1)<=$G$1),INDEX(base_indices,,),0))-1","v":0.15890939135224502},null,11,null,"010534596","GNR","https://www.insee.fr/fr/statistiques/serie/010534596",0.16641664166416636,-4.6673205819846464E-2,{"$f":"IF(SUM(IF((INDEX(compo,3,)=I16)*(INDEX(compo,,1)='Evol indices depuis janvier'!$D$7),INDEX(compo,,),0))>0,\"x\",\"\")","v":""}]
[{"$f":"OFFSET('Indice prix'!$B$2,0,$G17)","v":"010534646"},{"$f":"OFFSET('Indice prix'!$B$5,0,$G17)","v":"Béton prêt à l'emploi"},{"$f":"OFFSET('Indice prix'!$B$4,0,$G17)","v":"https://www.insee.fr/fr/statistiques/serie/010534646"},{"$f":"SUM(IF((INDEX(base_indices,1,)=$A17)*(INDEX(base_indices,,1)>=$D$2)*(INDEX(base_indices,,1)<=$E$2),INDEX(base_indices,,),0))/SUM(IF((INDEX(base_indices,1,)=$A17)*(INDEX(base_indices,,1)>=$F$2)*(INDEX(base_indices,,1)<=$G$2),INDEX(base_indices,,),0))-1","v":1.383191834398545E-2},{"$f":"SUM(IF((INDEX(base_indices,1,)=$A17)*(INDEX(base_indices,,1)>=$D$1)*(INDEX(base_indices,,1)<=$E$1),INDEX(base_indices,,),0))/SUM(IF((INDEX(base_indices,1,)=$A17)*(INDEX(base_indices,,1)>=$F$1)*(INDEX(base_indices,,1)<=$G$1),INDEX(base_indices,,),0))-1","v":1.3541865344268489E-2},null,12,null,"010534625","Plaques, feuilles, tubes et profilés en matières plastiques","https://www.insee.fr/fr/statistiques/serie/010534625",0.16080349708576192,0.11074594163927909,{"$f":"IF(SUM(IF((INDEX(compo,3,)=I17)*(INDEX(compo,,1)='Evol indices depuis janvier'!$D$7),INDEX(compo,,),0))>0,\"x\",\"\")","v":""}]
[{"$f":"OFFSET('Indice prix'!$B$2,0,$G18)","v":"010546545"},{"$f":"OFFSET('Indice prix'!$B$5,0,$G18)","v":"Barres crénelées ou nervurées pour béton armé"},{"$f":"OFFSET('Indice prix'!$B$4,0,$G18)","v":"https://www.insee.fr/fr/statistiques/serie/010546545"},{"$f":"SUM(IF((INDEX(base_indices,1,)=$A18)*(INDEX(base_indices,,1)>=$D$2)*(INDEX(base_indices,,1)<=$E$2),INDEX(base_indices,,),0))/SUM(IF((INDEX(base_indices,1,)=$A18)*(INDEX(base_indices,,1)>=$F$2)*(INDEX(base_indices,,1)<=$G$2),INDEX(base_indices,,),0))-1","v":0.49380706988518241},{"$f":"SUM(IF((INDEX(base_indices,1,)=$A18)*(INDEX(base_indices,,1)>=$D$1)*(INDEX(base_indices,,1)<=$E$1),INDEX(base_indices,,),0))/SUM(IF((INDEX(base_indices,1,)=$A18)*(INDEX(base_indices,,1)>=$F$1)*(INDEX(base_indices,,1)<=$G$1),INDEX(base_indices,,),0))-1","v":0.36126215191959177},null,13,null,"010534207","Tubes, tuyaux en matière plastique","https://www.insee.fr/fr/statistiques/serie/010534207",0.12234255916566394,0.11908809119088093,{"$f":"IF(SUM(IF((INDEX(compo,3,)=I18)*(INDEX(compo,,1)='Evol indices depuis janvier'!$D$7),INDEX(compo,,),0))>0,\"x\",\"\")","v":"x"}]
[{"$f":"OFFSET('Indice prix'!$B$2,0,$G19)","v":"010536067"},{"$f":"OFFSET('Indice prix'!$B$5,0,$G19)","v":"Sables et granulats"},{"$f":"OFFSET('Indice prix'!$B$4,0,$G19)","v":"https://www.insee.fr/fr/statistiques/serie/010536067"},{"$f":"SUM(IF((INDEX(base_indices,1,)=$A19)*(INDEX(base_indices,,1)>=$D$2)*(INDEX(base_indices,,1)<=$E$2),INDEX(base_indices,,),0))/SUM(IF((INDEX(base_indices,1,)=$A19)*(INDEX(base_indices,,1)>=$F$2)*(INDEX(base_indices,,1)<=$G$2),INDEX(base_indices,,),0))-1","v":1.1743012422360088E-2},{"$f":"SUM(IF((INDEX(base_indices,1,)=$A19)*(INDEX(base_indices,,1)>=$D$1)*(INDEX(base_indices,,1)<=$E$1),INDEX(base_indices,,),0))/SUM(IF((INDEX(base_indices,1,)=$A19)*(INDEX(base_indices,,1)>=$F$1)*(INDEX(base_indices,,1)<=$G$1),INDEX(base_indices,,),0))-1","v":2.8410772417875041E-2},null,14,null,"001764283","Gazole","https://www.insee.fr/fr/statistiques/serie/001764283",0.10335912591469243,-3.0775527236542199E-2,{"$f":"IF(SUM(IF((INDEX(compo,3,)=I19)*(INDEX(compo,,1)='Evol indices depuis janvier'!$D$7),INDEX(compo,,),0))>0,\"x\",\"\")","v":""}]
[{"$f":"OFFSET('Indice prix'!$B$2,0,$G20)","v":"010534625"},{"$f":"OFFSET('Indice prix'!$B$5,0,$G20)","v":"Plaques, feuilles, tubes et profilés en matières plastiques"},{"$f":"OFFSET('Indice prix'!$B$4,0,$G20)","v":"https://www.insee.fr/fr/statistiques/serie/010534625"},{"$f":"SUM(IF((INDEX(base_indices,1,)=$A20)*(INDEX(base_indices,,1)>=$D$2)*(INDEX(base_indices,,1)<=$E$2),INDEX(base_indices,,),0))/SUM(IF((INDEX(base_indices,1,)=$A20)*(INDEX(base_indices,,1)>=$F$2)*(INDEX(base_indices,,1)<=$G$2),INDEX(base_indices,,),0))-1","v":0.16080349708576192},{"$f":"SUM(IF((INDEX(base_indices,1,)=$A20)*(INDEX(base_indices,,1)>=$D$1)*(INDEX(base_indices,,1)<=$E$1),INDEX(base_indices,,),0))/SUM(IF((INDEX(base_indices,1,)=$A20)*(INDEX(base_indices,,1)>=$F$1)*(INDEX(base_indices,,1)<=$G$1),INDEX(base_indices,,),0))-1","v":0.11074594163927909},null,15,null,"010534654","Tubes, tuyaux, profilés creux et accessoires correspondants en acier","https://www.insee.fr/fr/statistiques/serie/010534654",8.0596164799696002E-2,5.9573675881969601E-2,{"$f":"IF(SUM(IF((INDEX(compo,3,)=I20)*(INDEX(compo,,1)='Evol indices depuis janvier'!$D$7),INDEX(compo,,),0))>0,\"x\",\"\")","v":""}]
[{"$f":"OFFSET('Indice prix'!$B$2,0,$G21)","v":"010534642"},{"$f":"OFFSET('Indice prix'!$B$5,0,$G21)","v":"Ciment, chaux et plâtre"},{"$f":"OFFSET('Indice prix'!$B$4,0,$G21)","v":"https://www.insee.fr/fr/statistiques/serie/010534642"},{"$f":"SUM(IF((INDEX(base_indices,1,)=$A21)*(INDEX(base_indices,,1)>=$D$2)*(INDEX(base_indices,,1)<=$E$2),INDEX(base_indices,,),0))/SUM(IF((INDEX(base_indices,1,)=$A21)*(INDEX(base_indices,,1)>=$F$2)*(INDEX(base_indices,,1)<=$G$2),INDEX(base_indices,,),0))-1","v":2.3323899677954341E-2},{"$f":"SUM(IF((INDEX(base_indices,1,)=$A21)*(INDEX(base_indices,,1)>=$D$1)*(INDEX(base_indices,,1)<=$E$1),INDEX(base_indices,,),0))/SUM(IF((INDEX(base_indices,1,)=$A21)*(INDEX(base_indices,,1)>=$F$1)*(INDEX(base_indices,,1)<=$G$1),INDEX(base_indices,,),0))-1","v":2.4824081313526092E-2},null,16,null,"010534667","Éléments en métal pour la construction","https://www.insee.fr/fr/statistiques/serie/010534667",5.8182151365218981E-2,8.6964705882353055E-2,{"$f":"IF(SUM(IF((INDEX(compo,3,)=I21)*(INDEX(compo,,1)='Evol indices depuis janvier'!$D$7),INDEX(compo,,),0))>0,\"x\",\"\")","v":""}]
[{"$f":"OFFSET('Indice prix'!$B$2,0,$G22)","v":"010534614"},{"$f":"OFFSET('Indice prix'!$B$5,0,$G22)","v":"Produits explosifs"},{"$f":"OFFSET('Indice prix'!$B$4,0,$G22)","v":"https://www.insee.fr/fr/statistiques/serie/010534614"},{"$f":"SUM(IF((INDEX(base_indices,1,)=$A22)*(INDEX(base_indices,,1)>=$D$2)*(INDEX(base_indices,,1)<=$E$2),INDEX(base_indices,,),0))/SUM(IF((INDEX(base_indices,1,)=$A22)*(INDEX(base_indices,,1)>=$F$2)*(INDEX(base_indices,,1)<=$G$2),INDEX(base_indices,,),0))-1","v":-1.6333589546503324E-3},{"$f":"SUM(IF((INDEX(base_indices,1,)=$A22)*(INDEX(base_indices,,1)>=$D$1)*(INDEX(base_indices,,1)<=$E$1),INDEX(base_indices,,),0))/SUM(IF((INDEX(base_indices,1,)=$A22)*(INDEX(base_indices,,1)>=$F$1)*(INDEX(base_indices,,1)<=$G$1),INDEX(base_indices,,),0))-1","v":6.6847510172445279E-3},null,17,null,"010534253","Tuyaux d'assainissement","https://www.insee.fr/fr/statistiques/serie/010534253",5.6208135132511217E-2,3.4417189579767804E-2,{"$f":"IF(SUM(IF((INDEX(compo,3,)=I22)*(INDEX(compo,,1)='Evol indices depuis janvier'!$D$7),INDEX(compo,,),0))>0,\"x\",\"\")","v":""}]
[{"$f":"OFFSET('Indice prix'!$B$2,0,$G23)","v":"010536462"},{"$f":"OFFSET('Indice prix'!$B$5,0,$G23)","v":"Acier pour la construction"},{"$f":"OFFSET('Indice prix'!$B$4,0,$G23)","v":"https://www.insee.fr/fr/statistiques/serie/010536462"},{"$f":"SUM(IF((INDEX(base_indices,1,)=$A23)*(INDEX(base_indices,,1)>=$D$2)*(INDEX(base_indices,,1)<=$E$2),INDEX(base_indices,,),0))/SUM(IF((INDEX(base_indices,1,)=$A23)*(INDEX(base_indices,,1)>=$F$2)*(INDEX(base_indices,,1)<=$G$2),INDEX(base_indices,,),0))-1","v":0.47459340255444271},{"$f":"SUM(IF((INDEX(base_indices,1,)=$A23)*(INDEX(base_indices,,1)>=$D$1)*(INDEX(base_indices,,1)<=$E$1),INDEX(base_indices,,),0))/SUM(IF((INDEX(base_indices,1,)=$A23)*(INDEX(base_indices,,1)>=$F$1)*(INDEX(base_indices,,1)<=$G$1),INDEX(base_indices,,),0))-1","v":0.34676065793890554},null,18,null,"010534662","Travaux de fonderie de fonte","https://www.insee.fr/fr/statistiques/serie/010534662",5.305124388688065E-2,4.4941449519991572E-2,{"$f":"IF(SUM(IF((INDEX(compo,3,)=I23)*(INDEX(compo,,1)='Evol indices depuis janvier'!$D$7),INDEX(compo,,),0))>0,\"x\",\"\")","v":""}]
[{"$f":"OFFSET('Indice prix'!$B$2,0,$G24)","v":"010534598"},{"$f":"OFFSET('Indice prix'!$B$5,0,$G24)","v":"Bitume"},{"$f":"OFFSET('Indice prix'!$B$4,0,$G24)","v":"https://www.insee.fr/fr/statistiques/serie/010534598"},{"$f":"SUM(IF((INDEX(base_indices,1,)=$A24)*(INDEX(base_indices,,1)>=$D$2)*(INDEX(base_indices,,1)<=$E$2),INDEX(base_indices,,),0))/SUM(IF((INDEX(base_indices,1,)=$A24)*(INDEX(base_indices,,1)>=$F$2)*(INDEX(base_indices,,1)<=$G$2),INDEX(base_indices,,),0))-1","v":0.1784524250277677},{"$f":"SUM(IF((INDEX(base_indices,1,)=$A24)*(INDEX(base_indices,,1)>=$D$1)*(INDEX(base_indices,,1)<=$E$1),INDEX(base_indices,,),0))/SUM(IF((INDEX(base_indices,1,)=$A24)*(INDEX(base_indices,,1)>=$F$1)*(INDEX(base_indices,,1)<=$G$1),INDEX(base_indices,,),0))-1","v":6.0575769692123194E-2},null,19,null,"010534789","Traitement et élimination des déchets non dangereux","https://www.insee.fr/fr/statistiques/serie/010534789",5.1931828321584605E-2,8.5043718361711651E-2,{"$f":"IF(SUM(IF((INDEX(compo,3,)=I24)*(INDEX(compo,,1)='Evol indices depuis janvier'!$D$7),INDEX(compo,,),0))>0,\"x\",\"\")","v":""}]
[{"$f":"OFFSET('Indice prix'!$B$2,0,$G25)","v":"010534252"},{"$f":"OFFSET('Indice prix'!$B$5,0,$G25)","v":"Produits de voierie en béton"},{"$f":"OFFSET('Indice prix'!$B$4,0,$G25)","v":"https://www.insee.fr/fr/statistiques/serie/010534252"},{"$f":"SUM(IF((INDEX(base_indices,1,)=$A25)*(INDEX(base_indices,,1)>=$D$2)*(INDEX(base_indices,,1)<=$E$2),INDEX(base_indices,,),0))/SUM(IF((INDEX(base_indices,1,)=$A25)*(INDEX(base_indices,,1)>=$F$2)*(INDEX(base_indices,,1)<=$G$2),INDEX(base_indices,,),0))-1","v":4.0738261451659152E-2},{"$f":"SUM(IF((INDEX(base_indices,1,)=$A25)*(INDEX(base_indices,,1)>=$D$1)*(INDEX(base_indices,,1)<=$E$1),INDEX(base_indices,,),0))/SUM(IF((INDEX(base_indices,1,)=$A25)*(INDEX(base_indices,,1)>=$F$1)*(INDEX(base_indices,,1)<=$G$1),INDEX(base_indices,,),0))-1","v":7.7738165973459949E-2},null,20,null,"010534252","Produits de voierie en béton","https://www.insee.fr/fr/statistiques/serie/010534252",4.0738261451659152E-2,7.7738165973459949E-2,{"$f":"IF(SUM(IF((INDEX(compo,3,)=I25)*(INDEX(compo,,1)='Evol indices depuis janvier'!$D$7),INDEX(compo,,),0))>0,\"x\",\"\")","v":""}]
[{"$f":"OFFSET('Indice prix'!$B$2,0,$G26)","v":"010534647"},{"$f":"OFFSET('Indice prix'!$B$5,0,$G26)","v":"Mortiers et bétons secs"},{"$f":"OFFSET('Indice prix'!$B$4,0,$G26)","v":"https://www.insee.fr/fr/statistiques/serie/010534647"},{"$f":"SUM(IF((INDEX(base_indices,1,)=$A26)*(INDEX(base_indices,,1)>=$D$2)*(INDEX(base_indices,,1)<=$E$2),INDEX(base_indices,,),0))/SUM(IF((INDEX(base_indices,1,)=$A26)*(INDEX(base_indices,,1)>=$F$2)*(INDEX(base_indices,,1)<=$G$2),INDEX(base_indices,,),0))-1","v":9.9285146942018621E-3},{"$f":"SUM(IF((INDEX(base_indices,1,)=$A26)*(INDEX(base_indices,,1)>=$D$1)*(INDEX(base_indices,,1)<=$E$1),INDEX(base_indices,,),0))/SUM(IF((INDEX(base_indices,1,)=$A26)*(INDEX(base_indices,,1)>=$F$1)*(INDEX(base_indices,,1)<=$G$1),INDEX(base_indices,,),0))-1","v":2.0363125689638162E-2},null,21,null,"010534769","Électricité vendue aux entreprises consommatrices finales","https://www.insee.fr/fr/statistiques/serie/010534769",3.987677562895775E-2,8.3452211126961551E-2,{"$f":"IF(SUM(IF((INDEX(compo,3,)=I26)*(INDEX(compo,,1)='Evol indices depuis janvier'!$D$7),INDEX(compo,,),0))>0,\"x\",\"\")","v":"x"}]
[{"$f":"OFFSET('Indice prix'!$B$2,0,$G27)","v":"010534662"},{"$f":"OFFSET('Indice prix'!$B$5,0,$G27)","v":"Travaux de fonderie de fonte"},{"$f":"OFFSET('Indice prix'!$B$4,0,$G27)","v":"https://www.insee.fr/fr/statistiques/serie/010534662"},{"$f":"SUM(IF((INDEX(base_indices,1,)=$A27)*(INDEX(base_indices,,1)>=$D$2)*(INDEX(base_indices,,1)<=$E$2),INDEX(base_indices,,),0))/SUM(IF((INDEX(base_indices,1,)=$A27)*(INDEX(base_indices,,1)>=$F$2)*(INDEX(base_indices,,1)<=$G$2),INDEX(base_indices,,),0))-1","v":5.305124388688065E-2},{"$f":"SUM(IF((INDEX(base_indices,1,)=$A27)*(INDEX(base_indices,,1)>=$D$1)*(INDEX(base_indices,,1)<=$E$1),INDEX(base_indices,,),0))/SUM(IF((INDEX(base_indices,1,)=$A27)*(INDEX(base_indices,,1)>=$F$1)*(INDEX(base_indices,,1)<=$G$1),INDEX(base_indices,,),0))-1","v":4.4941449519991572E-2},null,22,null,"001711009","Matériel","https://www.insee.fr/fr/statistiques/serie/001711009",2.9439969313387104E-2,2.0728344584957537E-2,{"$f":"IF(SUM(IF((INDEX(compo,3,)=I27)*(INDEX(compo,,1)='Evol indices depuis janvier'!$D$7),INDEX(compo,,),0))>0,\"x\",\"\")","v":"x"}]
[{"$f":"OFFSET('Indice prix'!$B$2,0,$G28)","v":"010534638"},{"$f":"OFFSET('Indice prix'!$B$5,0,$G28)","v":"Tuiles, briques et produits de construction en terre cuite"},{"$f":"OFFSET('Indice prix'!$B$4,0,$G28)","v":"https://www.insee.fr/fr/statistiques/serie/010534638"},{"$f":"SUM(IF((INDEX(base_indices,1,)=$A28)*(INDEX(base_indices,,1)>=$D$2)*(INDEX(base_indices,,1)<=$E$2),INDEX(base_indices,,),0))/SUM(IF((INDEX(base_indices,1,)=$A28)*(INDEX(base_indices,,1)>=$F$2)*(INDEX(base_indices,,1)<=$G$2),INDEX(base_indices,,),0))-1","v":9.2000774743365987E-3},{"$f":"SUM(IF((INDEX(base_indices,1,)=$A28)*(INDEX(base_indices,,1)>=$D$1)*(INDEX(base_indices,,1)<=$E$1),INDEX(base_indices,,),0))/SUM(IF((INDEX(base_indices,1,)=$A28)*(INDEX(base_indices,,1)>=$F$1)*(INDEX(base_indices,,1)<=$G$1),INDEX(base_indices,,),0))-1","v":2.6193993106844005E-2},null,23,null,"010534180","Peintures Industries","https://www.insee.fr/fr/statistiques/serie/010534180",2.487831260140605E-2,5.3460576299453111E-2,{"$f":"IF(SUM(IF((INDEX(compo,3,)=I28)*(INDEX(compo,,1)='Evol indices depuis janvier'!$D$7),INDEX(compo,,),0))>0,\"x\",\"\")","v":""}]
[{"$f":"OFFSET('Indice prix'!$B$2,0,$G29)","v":"010534253"},{"$f":"OFFSET('Indice prix'!$B$5,0,$G29)","v":"Tuyaux d'assainissement"},{"$f":"OFFSET('Indice prix'!$B$4,0,$G29)","v":"https://www.insee.fr/fr/statistiques/serie/010534253"},{"$f":"SUM(IF((INDEX(base_indices,1,)=$A29)*(INDEX(base_indices,,1)>=$D$2)*(INDEX(base_indices,,1)<=$E$2),INDEX(base_indices,,),0))/SUM(IF((INDEX(base_indices,1,)=$A29)*(INDEX(base_indices,,1)>=$F$2)*(INDEX(base_indices,,1)<=$G$2),INDEX(base_indices,,),0))-1","v":5.6208135132511217E-2},{"$f":"SUM(IF((INDEX(base_indices,1,)=$A29)*(INDEX(base_indices,,1)>=$D$1)*(INDEX(base_indices,,1)<=$E$1),INDEX(base_indices,,),0))/SUM(IF((INDEX(base_indices,1,)=$A29)*(INDEX(base_indices,,1)>=$F$1)*(INDEX(base_indices,,1)<=$G$1),INDEX(base_indices,,),0))-1","v":3.4417189579767804E-2},null,24,null,"010534698","Matériel de distribution et de commande électrique","https://www.insee.fr/fr/statistiques/serie/010534698",2.485733629944864E-2,4.5176563424738525E-2,{"$f":"IF(SUM(IF((INDEX(compo,3,)=I29)*(INDEX(compo,,1)='Evol indices depuis janvier'!$D$7),INDEX(compo,,),0))>0,\"x\",\"\")","v":""}]
[{"$f":"OFFSET('Indice prix'!$B$2,0,$G30)","v":"010534559"},{"$f":"OFFSET('Indice prix'!$B$5,0,$G30)","v":"Autres textiles n.c.a."},{"$f":"OFFSET('Indice prix'!$B$4,0,$G30)","v":"https://www.insee.fr/fr/statistiques/serie/010534559"},{"$f":"SUM(IF((INDEX(base_indices,1,)=$A30)*(INDEX(base_indices,,1)>=$D$2)*(INDEX(base_indices,,1)<=$E$2),INDEX(base_indices,,),0))/SUM(IF((INDEX(base_indices,1,)=$A30)*(INDEX(base_indices,,1)>=$F$2)*(INDEX(base_indices,,1)<=$G$2),INDEX(base_indices,,),0))-1","v":-4.3298019345924255E-3},{"$f":"SUM(IF((INDEX(base_indices,1,)=$A30)*(INDEX(base_indices,,1)>=$D$1)*(INDEX(base_indices,,1)<=$E$1),INDEX(base_indices,,),0))/SUM(IF((INDEX(base_indices,1,)=$A30)*(INDEX(base_indices,,1)>=$F$1)*(INDEX(base_indices,,1)<=$G$1),INDEX(base_indices,,),0))-1","v":1.0188015189402932E-3},null,25,null,"010534642","Ciment, chaux et plâtre","https://www.insee.fr/fr/statistiques/serie/010534642",2.3323899677954341E-2,2.4824081313526092E-2,{"$f":"IF(SUM(IF((INDEX(compo,3,)=I30)*(INDEX(compo,,1)='Evol indices depuis janvier'!$D$7),INDEX(compo,,),0))>0,\"x\",\"\")","v":""}]
[{"$f":"OFFSET('Indice prix'!$B$2,0,$G31)","v":"010534606"},{"$f":"OFFSET('Indice prix'!$B$5,0,$G31)","v":"Matières plastiques sous formes primaires"},{"$f":"OFFSET('Indice prix'!$B$4,0,$G31)","v":"https://www.insee.fr/fr/statistiques/serie/010534606"},{"$f":"SUM(IF((INDEX(base_indices,1,)=$A31)*(INDEX(base_indices,,1)>=$D$2)*(INDEX(base_indices,,1)<=$E$2),INDEX(base_indices,,),0))/SUM(IF((INDEX(base_indices,1,)=$A31)*(INDEX(base_indices,,1)>=$F$2)*(INDEX(base_indices,,1)<=$G$2),INDEX(base_indices,,),0))-1","v":0.41793830277747301},{"$f":"SUM(IF((INDEX(base_indices,1,)=$A31)*(INDEX(base_indices,,1)>=$D$1)*(INDEX(base_indices,,1)<=$E$1),INDEX(base_indices,,),0))/SUM(IF((INDEX(base_indices,1,)=$A31)*(INDEX(base_indices,,1)>=$F$1)*(INDEX(base_indices,,1)<=$G$1),INDEX(base_indices,,),0))-1","v":0.24695887236918335},null,26,null,"010534696","Moteurs, génératrices, transfo. électr., matér. distrib., cmde électr.","https://www.insee.fr/fr/statistiques/serie/010534696",1.6018527453440345E-2,2.6418405147202284E-2,{"$f":"IF(SUM(IF((INDEX(compo,3,)=I31)*(INDEX(compo,,1)='Evol indices depuis janvier'!$D$7),INDEX(compo,,),0))>0,\"x\",\"\")","v":""}]
[{"$f":"OFFSET('Indice prix'!$B$2,0,$G32)","v":"010534654"},{"$f":"OFFSET('Indice prix'!$B$5,0,$G32)","v":"Tubes, tuyaux, profilés creux et accessoires correspondants en acier"},{"$f":"OFFSET('Indice prix'!$B$4,0,$G32)","v":"https://www.insee.fr/fr/statistiques/serie/010534654"},{"$f":"SUM(IF((INDEX(base_indices,1,)=$A32)*(INDEX(base_indices,,1)>=$D$2)*(INDEX(base_indices,,1)<=$E$2),INDEX(base_indices,,),0))/SUM(IF((INDEX(base_indices,1,)=$A32)*(INDEX(base_indices,,1)>=$F$2)*(INDEX(base_indices,,1)<=$G$2),INDEX(base_indices,,),0))-1","v":8.0596164799696002E-2},{"$f":"SUM(IF((INDEX(base_indices,1,)=$A32)*(INDEX(base_indices,,1)>=$D$1)*(INDEX(base_indices,,1)<=$E$1),INDEX(base_indices,,),0))/SUM(IF((INDEX(base_indices,1,)=$A32)*(INDEX(base_indices,,1)>=$F$1)*(INDEX(base_indices,,1)<=$G$1),INDEX(base_indices,,),0))-1","v":5.9573675881969601E-2},null,27,null,"010534645","Éléments en béton pour la construction","https://www.insee.fr/fr/statistiques/serie/010534645",1.5975987606506425E-2,4.2005958291956302E-2,{"$f":"IF(SUM(IF((INDEX(compo,3,)=I32)*(INDEX(compo,,1)='Evol indices depuis janvier'!$D$7),INDEX(compo,,),0))>0,\"x\",\"\")","v":""}]
[{"$f":"OFFSET('Indice prix'!$B$2,0,$G33)","v":"010534645"},{"$f":"OFFSET('Indice prix'!$B$5,0,$G33)","v":"Éléments en béton pour la construction"},{"$f":"OFFSET('Indice prix'!$B$4,0,$G33)","v":"https://www.insee.fr/fr/statistiques/serie/010534645"},{"$f":"SUM(IF((INDEX(base_indices,1,)=$A33)*(INDEX(base_indices,,1)>=$D$2)*(INDEX(base_indices,,1)<=$E$2),INDEX(base_indices,,),0))/SUM(IF((INDEX(base_indices,1,)=$A33)*(INDEX(base_indices,,1)>=$F$2)*(INDEX(base_indices,,1)<=$G$2),INDEX(base_indices,,),0))-1","v":1.5975987606506425E-2},{"$f":"SUM(IF((INDEX(base_indices,1,)=$A33)*(INDEX(base_indices,,1)>=$D$1)*(INDEX(base_indices,,1)<=$E$1),INDEX(base_indices,,),0))/SUM(IF((INDEX(base_indices,1,)=$A33)*(INDEX(base_indices,,1)>=$F$1)*(INDEX(base_indices,,1)<=$G$1),INDEX(base_indices,,),0))-1","v":4.2005958291956302E-2},null,28,null,"001565195","Travail activités spécialisées","https://www.insee.fr/fr/statistiques/serie/001565195",1.5477072528196301E-2,3.3082077051926229E-2,{"$f":"IF(SUM(IF((INDEX(compo,3,)=I33)*(INDEX(compo,,1)='Evol indices depuis janvier'!$D$7),INDEX(compo,,),0))>0,\"x\",\"\")","v":""}]
[{"$f":"OFFSET('Indice prix'!$B$2,0,$G34)","v":"010534330"},{"$f":"OFFSET('Indice prix'!$B$5,0,$G34)","v":"Fils et câbles d'énergie"},{"$f":"OFFSET('Indice prix'!$B$4,0,$G34)","v":"https://www.insee.fr/fr/statistiques/serie/010534330"},{"$f":"SUM(IF((INDEX(base_indices,1,)=$A34)*(INDEX(base_indices,,1)>=$D$2)*(INDEX(base_indices,,1)<=$E$2),INDEX(base_indices,,),0))/SUM(IF((INDEX(base_indices,1,)=$A34)*(INDEX(base_indices,,1)>=$F$2)*(INDEX(base_indices,,1)<=$G$2),INDEX(base_indices,,),0))-1","v":0.18786096818229558},{"$f":"SUM(IF((INDEX(base_indices,1,)=$A34)*(INDEX(base_indices,,1)>=$D$1)*(INDEX(base_indices,,1)<=$E$1),INDEX(base_indices,,),0))/SUM(IF((INDEX(base_indices,1,)=$A34)*(INDEX(base_indices,,1)>=$F$1)*(INDEX(base_indices,,1)<=$G$1),INDEX(base_indices,,),0))-1","v":0.17735220649458738},null,29,null,"010534646","Béton prêt à l'emploi","https://www.insee.fr/fr/statistiques/serie/010534646",1.383191834398545E-2,1.3541865344268489E-2,{"$f":"IF(SUM(IF((INDEX(compo,3,)=I34)*(INDEX(compo,,1)='Evol indices depuis janvier'!$D$7),INDEX(compo,,),0))>0,\"x\",\"\")","v":"x"}]
[{"$f":"OFFSET('Indice prix'!$B$2,0,$G35)","v":"010534696"},{"$f":"OFFSET('Indice prix'!$B$5,0,$G35)","v":"Moteurs, génératrices, transfo. électr., matér. distrib., cmde électr."},{"$f":"OFFSET('Indice prix'!$B$4,0,$G35)","v":"https://www.insee.fr/fr/statistiques/serie/010534696"},{"$f":"SUM(IF((INDEX(base_indices,1,)=$A35)*(INDEX(base_indices,,1)>=$D$2)*(INDEX(base_indices,,1)<=$E$2),INDEX(base_indices,,),0))/SUM(IF((INDEX(base_indices,1,)=$A35)*(INDEX(base_indices,,1)>=$F$2)*(INDEX(base_indices,,1)<=$G$2),INDEX(base_indices,,),0))-1","v":1.6018527453440345E-2},{"$f":"SUM(IF((INDEX(base_indices,1,)=$A35)*(INDEX(base_indices,,1)>=$D$1)*(INDEX(base_indices,,1)<=$E$1),INDEX(base_indices,,),0))/SUM(IF((INDEX(base_indices,1,)=$A35)*(INDEX(base_indices,,1)>=$F$1)*(INDEX(base_indices,,1)<=$G$1),INDEX(base_indices,,),0))-1","v":2.6418405147202284E-2},null,30,null,"001711011","Frais divers","https://www.insee.fr/fr/statistiques/serie/001711011",1.2368344767610395E-2,1.3347519102427929E-2,{"$f":"IF(SUM(IF((INDEX(compo,3,)=I35)*(INDEX(compo,,1)='Evol indices depuis janvier'!$D$7),INDEX(compo,,),0))>0,\"x\",\"\")","v":"x"}]
[{"$f":"OFFSET('Indice prix'!$B$2,0,$G36)","v":"010534698"},{"$f":"OFFSET('Indice prix'!$B$5,0,$G36)","v":"Matériel de distribution et de commande électrique"},{"$f":"OFFSET('Indice prix'!$B$4,0,$G36)","v":"https://www.insee.fr/fr/statistiques/serie/010534698"},{"$f":"SUM(IF((INDEX(base_indices,1,)=$A36)*(INDEX(base_indices,,1)>=$D$2)*(INDEX(base_indices,,1)<=$E$2),INDEX(base_indices,,),0))/SUM(IF((INDEX(base_indices,1,)=$A36)*(INDEX(base_indices,,1)>=$F$2)*(INDEX(base_indices,,1)<=$G$2),INDEX(base_indices,,),0))-1","v":2.485733629944864E-2},{"$f":"SUM(IF((INDEX(base_indices,1,)=$A36)*(INDEX(base_indices,,1)>=$D$1)*(INDEX(base_indices,,1)<=$E$1),INDEX(base_indices,,),0))/SUM(IF((INDEX(base_indices,1,)=$A36)*(INDEX(base_indices,,1)>=$F$1)*(INDEX(base_indices,,1)<=$G$1),INDEX(base_indices,,),0))-1","v":4.5176563424738525E-2},null,31,null,"010536067","Sables et granulats","https://www.insee.fr/fr/statistiques/serie/010536067",1.1743012422360088E-2,2.8410772417875041E-2,{"$f":"IF(SUM(IF((INDEX(compo,3,)=I36)*(INDEX(compo,,1)='Evol indices depuis janvier'!$D$7),INDEX(compo,,),0))>0,\"x\",\"\")","v":""}]
[{"$f":"OFFSET('Indice prix'!$B$2,0,$G37)","v":"010534702"},{"$f":"OFFSET('Indice prix'!$B$5,0,$G37)","v":"Appareils d'éclairage électrique"},{"$f":"OFFSET('Indice prix'!$B$4,0,$G37)","v":"https://www.insee.fr/fr/statistiques/serie/010534702"},{"$f":"SUM(IF((INDEX(base_indices,1,)=$A37)*(INDEX(base_indices,,1)>=$D$2)*(INDEX(base_indices,,1)<=$E$2),INDEX(base_indices,,),0))/SUM(IF((INDEX(base_indices,1,)=$A37)*(INDEX(base_indices,,1)>=$F$2)*(INDEX(base_indices,,1)<=$G$2),INDEX(base_indices,,),0))-1","v":-3.5934291581107836E-3},{"$f":"SUM(IF((INDEX(base_indices,1,)=$A37)*(INDEX(base_indices,,1)>=$D$1)*(INDEX(base_indices,,1)<=$E$1),INDEX(base_indices,,),0))/SUM(IF((INDEX(base_indices,1,)=$A37)*(INDEX(base_indices,,1)>=$F$1)*(INDEX(base_indices,,1)<=$G$1),INDEX(base_indices,,),0))-1","v":-2.0290732889157947E-2},null,32,null,"010534647","Mortiers et bétons secs","https://www.insee.fr/fr/statistiques/serie/010534647",9.9285146942018621E-3,2.0363125689638162E-2,{"$f":"IF(SUM(IF((INDEX(compo,3,)=I37)*(INDEX(compo,,1)='Evol indices depuis janvier'!$D$7),INDEX(compo,,),0))>0,\"x\",\"\")","v":""}]
[{"$f":"OFFSET('Indice prix'!$B$2,0,$G38)","v":"010535345"},{"$f":"OFFSET('Indice prix'!$B$5,0,$G38)","v":"Câbles de fibres optiques"},{"$f":"OFFSET('Indice prix'!$B$4,0,$G38)","v":"https://www.insee.fr/fr/statistiques/serie/010535345"},{"$f":"SUM(IF((INDEX(base_indices,1,)=$A38)*(INDEX(base_indices,,1)>=$D$2)*(INDEX(base_indices,,1)<=$E$2),INDEX(base_indices,,),0))/SUM(IF((INDEX(base_indices,1,)=$A38)*(INDEX(base_indices,,1)>=$F$2)*(INDEX(base_indices,,1)<=$G$2),INDEX(base_indices,,),0))-1","v":-2.823639774859299E-2},{"$f":"SUM(IF((INDEX(base_indices,1,)=$A38)*(INDEX(base_indices,,1)>=$D$1)*(INDEX(base_indices,,1)<=$E$1),INDEX(base_indices,,),0))/SUM(IF((INDEX(base_indices,1,)=$A38)*(INDEX(base_indices,,1)>=$F$1)*(INDEX(base_indices,,1)<=$G$1),INDEX(base_indices,,),0))-1","v":-4.1188448722695337E-2},null,33,null,"010534638","Tuiles, briques et produits de construction en terre cuite","https://www.insee.fr/fr/statistiques/serie/010534638",9.2000774743365987E-3,2.6193993106844005E-2,{"$f":"IF(SUM(IF((INDEX(compo,3,)=I38)*(INDEX(compo,,1)='Evol indices depuis janvier'!$D$7),INDEX(compo,,),0))>0,\"x\",\"\")","v":""}]
[{"$f":"OFFSET('Indice prix'!$B$2,0,$G39)","v":"010534180"},{"$f":"OFFSET('Indice prix'!$B$5,0,$G39)","v":"Peintures Industries"},{"$f":"OFFSET('Indice prix'!$B$4,0,$G39)","v":"https://www.insee.fr/fr/statistiques/serie/010534180"},{"$f":"SUM(IF((INDEX(base_indices,1,)=$A39)*(INDEX(base_indices,,1)>=$D$2)*(INDEX(base_indices,,1)<=$E$2),INDEX(base_indices,,),0))/SUM(IF((INDEX(base_indices,1,)=$A39)*(INDEX(base_indices,,1)>=$F$2)*(INDEX(base_indices,,1)<=$G$2),INDEX(base_indices,,),0))-1","v":2.487831260140605E-2},{"$f":"SUM(IF((INDEX(base_indices,1,)=$A39)*(INDEX(base_indices,,1)>=$D$1)*(INDEX(base_indices,,1)<=$E$1),INDEX(base_indices,,),0))/SUM(IF((INDEX(base_indices,1,)=$A39)*(INDEX(base_indices,,1)>=$F$1)*(INDEX(base_indices,,1)<=$G$1),INDEX(base_indices,,),0))-1","v":5.3460576299453111E-2},null,34,null,"001763781","Restaurants et hôtels","https://www.insee.fr/fr/statistiques/serie/001763781",5.7159214730271302E-3,1.5733124428776613E-2,{"$f":"IF(SUM(IF((INDEX(compo,3,)=I39)*(INDEX(compo,,1)='Evol indices depuis janvier'!$D$7),INDEX(compo,,),0))>0,\"x\",\"\")","v":""}]
[{"$f":"OFFSET('Indice prix'!$B$2,0,$G40)","v":"010534267"},{"$f":"OFFSET('Indice prix'!$B$5,0,$G40)","v":"Produits sidérurgiques en acier non allié"},{"$f":"OFFSET('Indice prix'!$B$4,0,$G40)","v":"https://www.insee.fr/fr/statistiques/serie/010534267"},{"$f":"SUM(IF((INDEX(base_indices,1,)=$A40)*(INDEX(base_indices,,1)>=$D$2)*(INDEX(base_indices,,1)<=$E$2),INDEX(base_indices,,),0))/SUM(IF((INDEX(base_indices,1,)=$A40)*(INDEX(base_indices,,1)>=$F$2)*(INDEX(base_indices,,1)<=$G$2),INDEX(base_indices,,),0))-1","v":0.26905999055266894},{"$f":"SUM(IF((INDEX(base_indices,1,)=$A40)*(INDEX(base_indices,,1)>=$D$1)*(INDEX(base_indices,,1)<=$E$1),INDEX(base_indices,,),0))/SUM(IF((INDEX(base_indices,1,)=$A40)*(INDEX(base_indices,,1)>=$F$1)*(INDEX(base_indices,,1)<=$G$1),INDEX(base_indices,,),0))-1","v":0.18081926863572417},null,35,null,"001711943","Transports routiers","https://www.insee.fr/fr/statistiques/serie/001711943",3.2867707477404196E-3,4.5708017186214533E-3,{"$f":"IF(SUM(IF((INDEX(compo,3,)=I40)*(INDEX(compo,,1)='Evol indices depuis janvier'!$D$7),INDEX(compo,,),0))>0,\"x\",\"\")","v":"x"}]
[{"$f":"OFFSET('Indice prix'!$B$2,0,$G41)","v":"010536480"},{"$f":"OFFSET('Indice prix'!$B$5,0,$G41)","v":"Tôles quarto et autres produits plats en aciers non alliés de qualité"},{"$f":"OFFSET('Indice prix'!$B$4,0,$G41)","v":"https://www.insee.fr/fr/statistiques/serie/010536480"},{"$f":"SUM(IF((INDEX(base_indices,1,)=$A41)*(INDEX(base_indices,,1)>=$D$2)*(INDEX(base_indices,,1)<=$E$2),INDEX(base_indices,,),0))/SUM(IF((INDEX(base_indices,1,)=$A41)*(INDEX(base_indices,,1)>=$F$2)*(INDEX(base_indices,,1)<=$G$2),INDEX(base_indices,,),0))-1","v":0.58393051031487486},{"$f":"SUM(IF((INDEX(base_indices,1,)=$A41)*(INDEX(base_indices,,1)>=$D$1)*(INDEX(base_indices,,1)<=$E$1),INDEX(base_indices,,),0))/SUM(IF((INDEX(base_indices,1,)=$A41)*(INDEX(base_indices,,1)>=$F$1)*(INDEX(base_indices,,1)<=$G$1),INDEX(base_indices,,),0))-1","v":0.44564463383212782},null,36,null,"010534614","Produits explosifs","https://www.insee.fr/fr/statistiques/serie/010534614",-1.6333589546503324E-3,6.6847510172445279E-3,{"$f":"IF(SUM(IF((INDEX(compo,3,)=I41)*(INDEX(compo,,1)='Evol indices depuis janvier'!$D$7),INDEX(compo,,),0))>0,\"x\",\"\")","v":""}]
[{"$f":"OFFSET('Indice prix'!$B$2,0,$G42)","v":"010534667"},{"$f":"OFFSET('Indice prix'!$B$5,0,$G42)","v":"Éléments en métal pour la construction"},{"$f":"OFFSET('Indice prix'!$B$4,0,$G42)","v":"https://www.insee.fr/fr/statistiques/serie/010534667"},{"$f":"SUM(IF((INDEX(base_indices,1,)=$A42)*(INDEX(base_indices,,1)>=$D$2)*(INDEX(base_indices,,1)<=$E$2),INDEX(base_indices,,),0))/SUM(IF((INDEX(base_indices,1,)=$A42)*(INDEX(base_indices,,1)>=$F$2)*(INDEX(base_indices,,1)<=$G$2),INDEX(base_indices,,),0))-1","v":5.8182151365218981E-2},{"$f":"SUM(IF((INDEX(base_indices,1,)=$A42)*(INDEX(base_indices,,1)>=$D$1)*(INDEX(base_indices,,1)<=$E$1),INDEX(base_indices,,),0))/SUM(IF((INDEX(base_indices,1,)=$A42)*(INDEX(base_indices,,1)>=$F$1)*(INDEX(base_indices,,1)<=$G$1),INDEX(base_indices,,),0))-1","v":8.6964705882353055E-2},null,37,null,"010534702","Appareils d'éclairage électrique","https://www.insee.fr/fr/statistiques/serie/010534702",-3.5934291581107836E-3,-2.0290732889157947E-2,{"$f":"IF(SUM(IF((INDEX(compo,3,)=I42)*(INDEX(compo,,1)='Evol indices depuis janvier'!$D$7),INDEX(compo,,),0))>0,\"x\",\"\")","v":""}]
[{"$f":"OFFSET('Indice prix'!$B$2,0,$G43)","v":"001763781"},{"$f":"OFFSET('Indice prix'!$B$5,0,$G43)","v":"Restaurants et hôtels"},{"$f":"OFFSET('Indice prix'!$B$4,0,$G43)","v":"https://www.insee.fr/fr/statistiques/serie/001763781"},{"$f":"SUM(IF((INDEX(base_indices,1,)=$A43)*(INDEX(base_indices,,1)>=$D$2)*(INDEX(base_indices,,1)<=$E$2),INDEX(base_indices,,),0))/SUM(IF((INDEX(base_indices,1,)=$A43)*(INDEX(base_indices,,1)>=$F$2)*(INDEX(base_indices,,1)<=$G$2),INDEX(base_indices,,),0))-1","v":5.7159214730271302E-3},{"$f":"SUM(IF((INDEX(base_indices,1,)=$A43)*(INDEX(base_indices,,1)>=$D$1)*(INDEX(base_indices,,1)<=$E$1),INDEX(base_indices,,),0))/SUM(IF((INDEX(base_indices,1,)=$A43)*(INDEX(base_indices,,1)>=$F$1)*(INDEX(base_indices,,1)<=$G$1),INDEX(base_indices,,),0))-1","v":1.5733124428776613E-2},null,38,null,"010534559","Autres textiles n.c.a.","https://www.insee.fr/fr/statistiques/serie/010534559",-4.3298019345924255E-3,1.0188015189402932E-3,{"$f":"IF(SUM(IF((INDEX(compo,3,)=I43)*(INDEX(compo,,1)='Evol indices depuis janvier'!$D$7),INDEX(compo,,),0))>0,\"x\",\"\")","v":""}]
[{"$f":"OFFSET('Indice prix'!$B$2,0,$G44)","v":"010534789"},{"$f":"OFFSET('Indice prix'!$B$5,0,$G44)","v":"Traitement et élimination des déchets non dangereux"},{"$f":"OFFSET('Indice prix'!$B$4,0,$G44)","v":"https://www.insee.fr/fr/statistiques/serie/010534789"},{"$f":"SUM(IF((INDEX(base_indices,1,)=$A44)*(INDEX(base_indices,,1)>=$D$2)*(INDEX(base_indices,,1)<=$E$2),INDEX(base_indices,,),0))/SUM(IF((INDEX(base_indices,1,)=$A44)*(INDEX(base_indices,,1)>=$F$2)*(INDEX(base_indices,,1)<=$G$2),INDEX(base_indices,,),0))-1","v":5.1931828321584605E-2},{"$f":"SUM(IF((INDEX(base_indices,1,)=$A44)*(INDEX(base_indices,,1)>=$D$1)*(INDEX(base_indices,,1)<=$E$1),INDEX(base_indices,,),0))/SUM(IF((INDEX(base_indices,1,)=$A44)*(INDEX(base_indices,,1)>=$F$1)*(INDEX(base_indices,,1)<=$G$1),INDEX(base_indices,,),0))-1","v":8.5043718361711651E-2},null,39,null,"5540998","Travail","https://www.insee.fr/fr/statistiques/6020697",-6.3081277800242086E-3,3.4299714169048201E-3,{"$f":"IF(SUM(IF((INDEX(compo,3,)=I44)*(INDEX(compo,,1)='Evol indices depuis janvier'!$D$7),INDEX(compo,,),0))>0,\"x\",\"\")","v":"x"}]
[{"$f":"OFFSET('Indice prix'!$B$2,0,$G45)","v":"010534784"},{"$f":"OFFSET('Indice prix'!$B$5,0,$G45)","v":"Collecte, traitement et élimination des déchets ; récupération de matériaux"},{"$f":"OFFSET('Indice prix'!$B$4,0,$G45)","v":"https://www.insee.fr/fr/statistiques/serie/010534784"},{"$f":"SUM(IF((INDEX(base_indices,1,)=$A45)*(INDEX(base_indices,,1)>=$D$2)*(INDEX(base_indices,,1)<=$E$2),INDEX(base_indices,,),0))/SUM(IF((INDEX(base_indices,1,)=$A45)*(INDEX(base_indices,,1)>=$F$2)*(INDEX(base_indices,,1)<=$G$2),INDEX(base_indices,,),0))-1","v":0.19095931692616785},{"$f":"SUM(IF((INDEX(base_indices,1,)=$A45)*(INDEX(base_indices,,1)>=$D$1)*(INDEX(base_indices,,1)<=$E$1),INDEX(base_indices,,),0))/SUM(IF((INDEX(base_indices,1,)=$A45)*(INDEX(base_indices,,1)>=$F$1)*(INDEX(base_indices,,1)<=$G$1),INDEX(base_indices,,),0))-1","v":0.16406480117820332},null,40,null,"010535345","Câbles de fibres optiques","https://www.insee.fr/fr/statistiques/serie/010535345",-2.823639774859299E-2,-4.1188448722695337E-2,{"$f":"IF(SUM(IF((INDEX(compo,3,)=I45)*(INDEX(compo,,1)='Evol indices depuis janvier'!$D$7),INDEX(compo,,),0))>0,\"x\",\"\")","v":""}]

{"sheet":"Index 3-6 mois glissants","index":14,"n_rows":30,"n_cols":11,"rows_kept":30,"cut":false,"hidden":true,"merged":[]}
[null,null,{"$f":"EDATE(date,-2)","v":"2021-08-01"},{"$f":"DATE(2021,MONTH(date),1)","v":"2021-10-01"},{"$f":"EDATE(date,-5)","v":"2021-05-01"},{"$f":"EDATE(date,-3)","v":"2021-07-01"},null,{"$f":"\"* 3 mois = \"&TEXT(C1,\"mmm aaaa\")&\"-\"&TEXT(D1,\"mmm aaaa\")&\" / \"&TEXT(E1,\"mmm aaaa\")&\"-\"&TEXT(F1,\"mmm aaaa\")","v":"* 3 mois = août 2021-oct 2021 / mai 2021-juil 2021"}]
[null,null,{"$f":"EDATE(date,-5)","v":"2021-05-01"},{"$f":"DATE(2021,MONTH(date),1)","v":"2021-10-01"},{"$f":"EDATE(date,-11)","v":"2020-11-01"},{"$f":"EDATE(date,-6)","v":"2021-04-01"},null,{"$f":"\"* 6 mois = \"&TEXT(C2,\"mmm aaaa\")&\"-\"&TEXT(D2,\"mmm aaaa\")&\" / \"&TEXT(E2,\"mmm aaaa\")&\"-\"&TEXT(F2,\"mmm aaaa\")","v":"* 6 mois = mai 2021-oct 2021 / nov 2020-avr 2021"}]
[null,null,null,null,null,null,null,{"$f":"\"Cumul \"&TEXT(C1,\"mmm aaaa\")&\"-\"&TEXT(D1,\"mmm aaaa\")&\" / Cumul \"&TEXT(E1,\"mmm aaaa\")&\"-\"&TEXT(F1,\"mmm aaaa\")","v":"Cumul août 2021-oct 2021 / Cumul mai 2021-juil 2021"}]
[null,null,"3 mois","6 mois",null,null,null,{"$f":"\"Cumul \"&TEXT(C2,\"mmm aaaa\")&\"-\"&TEXT(D2,\"mmm aaaa\")&\" / Cumul \"&TEXT(E2,\"mmm aaaa\")&\"-\"&TEXT(F2,\"mmm aaaa\")","v":"Cumul mai 2021-oct 2021 / Cumul nov 2020-avr 2021"}]
["TP01",{"$f":"VLOOKUP(A5,'Noms index'!$A$1:$B$23,2,FALSE)","v":"Index général tous travaux"},{"$f":"SUM(IF((INDEX(base_index,1,)=$A5)*(INDEX(base_index,,1)>=$C$1)*(INDEX(base_index,,1)<=$D$1),INDEX(base_index,,),0))/SUM(IF((INDEX(base_index,1,)=$A5)*(INDEX(base_index,,1)>=$E$1)*(INDEX(base_index,,1)<=$F$1),INDEX(base_index,,),0))-1","v":1.5375689004931692E-2},{"$f":"SUM(IF((INDEX(base_index,1,)=$A5)*(INDEX(base_index,,1)>=$C$2)*(INDEX(base_index,,1)<=$D$2),INDEX(base_index,,),0))/SUM(IF((INDEX(base_index,1,)=$A5)*(INDEX(base_index,,1)>=$E$2)*(INDEX(base_index,,1)<=$F$2),INDEX(base_index,,),0))-1","v":3.7020450813554318E-2},"https://www.insee.fr/fr/statistiques/serie/001711007"]
["TP02",{"$f":"VLOOKUP(A6,'Noms index'!$A$1:$B$23,2,FALSE)","v":"Travaux de génie civil et d’ouvrages d’art neufs ou rénovation"},{"$f":"SUM(IF((INDEX(base_index,1,)=$A6)*(INDEX(base_index,,1)>=$C$1)*(INDEX(base_index,,1)<=$D$1),INDEX(base_index,,),0))/SUM(IF((INDEX(base_index,1,)=$A6)*(INDEX(base_index,,1)>=$E$1)*(INDEX(base_index,,1)<=$F$1),INDEX(base_index,,),0))-1","v":2.1793103448275897E-2},{"$f":"SUM(IF((INDEX(base_index,1,)=$A6)*(INDEX(base_index,,1)>=$C$2)*(INDEX(base_index,,1)<=$D$2),INDEX(base_index,,),0))/SUM(IF((INDEX(base_index,1,)=$A6)*(INDEX(base_index,,1)>=$E$2)*(INDEX(base_index,,1)<=$F$2),INDEX(base_index,,),0))-1","v":4.6850449935723626E-2},"https://www.insee.fr/fr/statistiques/serie/001710987"]
["TP03a",{"$f":"VLOOKUP(A7,'Noms index'!$A$1:$B$23,2,FALSE)","v":"Grands terrassements"},{"$f":"SUM(IF((INDEX(base_index,1,)=$A7)*(INDEX(base_index,,1)>=$C$1)*(INDEX(base_index,,1)<=$D$1),INDEX(base_index,,),0))/SUM(IF((INDEX(base_index,1,)=$A7)*(INDEX(base_index,,1)>=$E$1)*(INDEX(base_index,,1)<=$F$1),INDEX(base_index,,),0))-1","v":8.2620241959281415E-3},{"$f":"SUM(IF((INDEX(base_index,1,)=$A7)*(INDEX(base_index,,1)>=$C$2)*(INDEX(base_index,,1)<=$D$2),INDEX(base_index,,),0))/SUM(IF((INDEX(base_index,1,)=$A7)*(INDEX(base_index,,1)>=$E$2)*(INDEX(base_index,,1)<=$F$2),INDEX(base_index,,),0))-1","v":2.284340246468286E-2},"https://www.insee.fr/fr/statistiques/serie/001710988"]
["TP03b",{"$f":"VLOOKUP(A8,'Noms index'!$A$1:$B$23,2,FALSE)","v":"Travaux à l’explosif"},{"$f":"SUM(IF((INDEX(base_index,1,)=$A8)*(INDEX(base_index,,1)>=$C$1)*(INDEX(base_index,,1)<=$D$1),INDEX(base_index,,),0))/SUM(IF((INDEX(base_index,1,)=$A8)*(INDEX(base_index,,1)>=$E$1)*(INDEX(base_index,,1)<=$F$1),INDEX(base_index,,),0))-1","v":4.8455481526348265E-3},{"$f":"SUM(IF((INDEX(base_index,1,)=$A8)*(INDEX(base_index,,1)>=$C$2)*(INDEX(base_index,,1)<=$D$2),INDEX(base_index,,),0))/SUM(IF((INDEX(base_index,1,)=$A8)*(INDEX(base_index,,1)>=$E$2)*(INDEX(base_index,,1)<=$F$2),INDEX(base_index,,),0))-1","v":1.7365913631473884E-2},"https://www.insee.fr/fr/statistiques/serie/001710988",null,{"$f":"_xlfn._xlws.SORT('Index 3-6 mois glissants'!$A$5:$E$27,3,-1)","v":"TP13"},"Charpentes et ouvrages d’art métalliques ",0.12454823463997755,0.10242354298903655,"https://www.insee.fr/fr/statistiques/serie/001711005"]
["TP04",{"$f":"VLOOKUP(A9,'Noms index'!$A$1:$B$23,2,FALSE)","v":"Fondations et travaux géotechniques "},{"$f":"SUM(IF((INDEX(base_index,1,)=$A9)*(INDEX(base_index,,1)>=$C$1)*(INDEX(base_index,,1)<=$D$1),INDEX(base_index,,),0))/SUM(IF((INDEX(base_index,1,)=$A9)*(INDEX(base_index,,1)>=$E$1)*(INDEX(base_index,,1)<=$F$1),INDEX(base_index,,),0))-1","v":2.2771998875456889E-2},{"$f":"SUM(IF((INDEX(base_index,1,)=$A9)*(INDEX(base_index,,1)>=$C$2)*(INDEX(base_index,,1)<=$D$2),INDEX(base_index,,),0))/SUM(IF((INDEX(base_index,1,)=$A9)*(INDEX(base_index,,1)>=$E$2)*(INDEX(base_index,,1)<=$F$2),INDEX(base_index,,),0))-1","v":5.452147149347808E-2},"https://www.insee.fr/fr/statistiques/serie/001710990",null,"TP07b","Travaux de génie civil, béton et acier pour ouvrages maritimes",9.6521973577784026E-2,0.19925971622455285,"https://www.insee.fr/fr/statistiques/serie/001710995"]
["TP05a",{"$f":"VLOOKUP(A10,'Noms index'!$A$1:$B$23,2,FALSE)","v":"Travaux en souterrains traditionnels "},{"$f":"SUM(IF((INDEX(base_index,1,)=$A10)*(INDEX(base_index,,1)>=$C$1)*(INDEX(base_index,,1)<=$D$1),INDEX(base_index,,),0))/SUM(IF((INDEX(base_index,1,)=$A10)*(INDEX(base_index,,1)>=$E$1)*(INDEX(base_index,,1)<=$F$1),INDEX(base_index,,),0))-1","v":1.4827487881380108E-2},{"$f":"SUM(IF((INDEX(base_index,1,)=$A10)*(INDEX(base_index,,1)>=$C$2)*(INDEX(base_index,,1)<=$D$2),INDEX(base_index,,),0))/SUM(IF((INDEX(base_index,1,)=$A10)*(INDEX(base_index,,1)>=$E$2)*(INDEX(base_index,,1)<=$F$2),INDEX(base_index,,),0))-1","v":3.409922435240742E-2},"https://www.insee.fr/fr/statistiques/serie/001710991",null,"TP09","Fabrication et mise en œuvre d’enrobés ",2.8503562945368044E-2,6.5834633385335461E-2,"https://www.insee.fr/fr/statistiques/serie/001710997"]
["TP05b",{"$f":"VLOOKUP(A11,'Noms index'!$A$1:$B$23,2,FALSE)","v":"Travaux en souterrains avec tunnelier "},{"$f":"SUM(IF((INDEX(base_index,1,)=$A11)*(INDEX(base_index,,1)>=$C$1)*(INDEX(base_index,,1)<=$D$1),INDEX(base_index,,),0))/SUM(IF((INDEX(base_index,1,)=$A11)*(INDEX(base_index,,1)>=$E$1)*(INDEX(base_index,,1)<=$F$1),INDEX(base_index,,),0))-1","v":1.3737836290784289E-2},{"$f":"SUM(IF((INDEX(base_index,1,)=$A11)*(INDEX(base_index,,1)>=$C$2)*(INDEX(base_index,,1)<=$D$2),INDEX(base_index,,),0))/SUM(IF((INDEX(base_index,1,)=$A11)*(INDEX(base_index,,1)>=$E$2)*(INDEX(base_index,,1)<=$F$2),INDEX(base_index,,),0))-1","v":3.0161054172767043E-2},"https://www.insee.fr/fr/statistiques/serie/001710992",null,"TP04","Fondations et travaux géotechniques ",2.2771998875456889E-2,5.452147149347808E-2,"https://www.insee.fr/fr/statistiques/serie/001710990"]
["TP06a",{"$f":"VLOOKUP(A12,'Noms index'!$A$1:$B$23,2,FALSE)","v":"Grands dragages maritimes "},{"$f":"SUM(IF((INDEX(base_index,1,)=$A12)*(INDEX(base_index,,1)>=$C$1)*(INDEX(base_index,,1)<=$D$1),INDEX(base_index,,),0))/SUM(IF((INDEX(base_index,1,)=$A12)*(INDEX(base_index,,1)>=$E$1)*(INDEX(base_index,,1)<=$F$1),INDEX(base_index,,),0))-1","v":2.2416302765647655E-2},{"$f":"SUM(IF((INDEX(base_index,1,)=$A12)*(INDEX(base_index,,1)>=$C$2)*(INDEX(base_index,,1)<=$D$2),INDEX(base_index,,),0))/SUM(IF((INDEX(base_index,1,)=$A12)*(INDEX(base_index,,1)>=$E$2)*(INDEX(base_index,,1)<=$F$2),INDEX(base_index,,),0))-1","v":4.5133142771174972E-2},"https://www.insee.fr/fr/statistiques/serie/001710993",null,"TP06a","Grands dragages maritimes ",2.2416302765647655E-2,4.5133142771174972E-2,"https://www.insee.fr/fr/statistiques/serie/001710993"]
["TP06b",{"$f":"VLOOKUP(A13,'Noms index'!$A$1:$B$23,2,FALSE)","v":"Dragages fluviaux et petits dragages maritimes"},{"$f":"SUM(IF((INDEX(base_index,1,)=$A13)*(INDEX(base_index,,1)>=$C$1)*(INDEX(base_index,,1)<=$D$1),INDEX(base_index,,),0))/SUM(IF((INDEX(base_index,1,)=$A13)*(INDEX(base_index,,1)>=$E$1)*(INDEX(base_index,,1)<=$F$1),INDEX(base_index,,),0))-1","v":9.3233082706767334E-3},{"$f":"SUM(IF((INDEX(base_index,1,)=$A13)*(INDEX(base_index,,1)>=$C$2)*(INDEX(base_index,,1)<=$D$2),INDEX(base_index,,),0))/SUM(IF((INDEX(base_index,1,)=$A13)*(INDEX(base_index,,1)>=$E$2)*(INDEX(base_index,,1)<=$F$2),INDEX(base_index,,),0))-1","v":2.4850437183616902E-2},"https://www.insee.fr/fr/statistiques/serie/001710994",null,"TP02","Travaux de génie civil et d’ouvrages d’art neufs ou rénovation",2.1793103448275897E-2,4.6850449935723626E-2,"https://www.insee.fr/fr/statistiques/serie/001710987"]
["TP07b",{"$f":"VLOOKUP(A14,'Noms index'!$A$1:$B$23,2,FALSE)","v":"Travaux de génie civil, béton et acier pour ouvrages maritimes"},{"$f":"SUM(IF((INDEX(base_index,1,)=$A14)*(INDEX(base_index,,1)>=$C$1)*(INDEX(base_index,,1)<=$D$1),INDEX(base_index,,),0))/SUM(IF((INDEX(base_index,1,)=$A14)*(INDEX(base_index,,1)>=$E$1)*(INDEX(base_index,,1)<=$F$1),INDEX(base_index,,),0))-1","v":9.6521973577784026E-2},{"$f":"SUM(IF((INDEX(base_index,1,)=$A14)*(INDEX(base_index,,1)>=$C$2)*(INDEX(base_index,,1)<=$D$2),INDEX(base_index,,),0))/SUM(IF((INDEX(base_index,1,)=$A14)*(INDEX(base_index,,1)>=$E$2)*(INDEX(base_index,,1)<=$F$2),INDEX(base_index,,),0))-1","v":0.19925971622455285},"https://www.insee.fr/fr/statistiques/serie/001710995",null,"TP11","Canalisations grandes distances de transport / transfert  avec fourniture de tuyaux",2.0788749617853819E-2,4.0289581366068639E-2,"https://www.insee.fr/fr/statistiques/serie/001711001"]
["TP08",{"$f":"VLOOKUP(A15,'Noms index'!$A$1:$B$23,2,FALSE)","v":"Travaux d’aménagement et entretien de voirie"},{"$f":"SUM(IF((INDEX(base_index,1,)=$A15)*(INDEX(base_index,,1)>=$C$1)*(INDEX(base_index,,1)<=$D$1),INDEX(base_index,,),0))/SUM(IF((INDEX(base_index,1,)=$A15)*(INDEX(base_index,,1)>=$E$1)*(INDEX(base_index,,1)<=$F$1),INDEX(base_index,,),0))-1","v":1.6843971631205878E-2},{"$f":"SUM(IF((INDEX(base_index,1,)=$A15)*(INDEX(base_index,,1)>=$C$2)*(INDEX(base_index,,1)<=$D$2),INDEX(base_index,,),0))/SUM(IF((INDEX(base_index,1,)=$A15)*(INDEX(base_index,,1)>=$E$2)*(INDEX(base_index,,1)<=$F$2),INDEX(base_index,,),0))-1","v":3.833865814696491E-2},"https://www.insee.fr/fr/statistiques/serie/001710996",null,"TP08","Travaux d’aménagement et entretien de voirie",1.6843971631205878E-2,3.833865814696491E-2,"https://www.insee.fr/fr/statistiques/serie/001710996"]
["TP09",{"$f":"VLOOKUP(A16,'Noms index'!$A$1:$B$23,2,FALSE)","v":"Fabrication et mise en œuvre d’enrobés "},{"$f":"SUM(IF((INDEX(base_index,1,)=$A16)*(INDEX(base_index,,1)>=$C$1)*(INDEX(base_index,,1)<=$D$1),INDEX(base_index,,),0))/SUM(IF((INDEX(base_index,1,)=$A16)*(INDEX(base_index,,1)>=$E$1)*(INDEX(base_index,,1)<=$F$1),INDEX(base_index,,),0))-1","v":2.8503562945368044E-2},{"$f":"SUM(IF((INDEX(base_index,1,)=$A16)*(INDEX(base_index,,1)>=$C$2)*(INDEX(base_index,,1)<=$D$2),INDEX(base_index,,),0))/SUM(IF((INDEX(base_index,1,)=$A16)*(INDEX(base_index,,1)>=$E$2)*(INDEX(base_index,,1)<=$F$2),INDEX(base_index,,),0))-1","v":6.5834633385335461E-2},"https://www.insee.fr/fr/statistiques/serie/001710997",null,"TP01","Index général tous travaux",1.5375689004931692E-2,3.7020450813554318E-2,"https://www.insee.fr/fr/statistiques/serie/001711007"]
["TP10a",{"$f":"VLOOKUP(A17,'Noms index'!$A$1:$B$23,2,FALSE)","v":"Canalisations, assainissement et adduction d’eau avec fourniture de tuyaux "},{"$f":"SUM(IF((INDEX(base_index,1,)=$A17)*(INDEX(base_index,,1)>=$C$1)*(INDEX(base_index,,1)<=$D$1),INDEX(base_index,,),0))/SUM(IF((INDEX(base_index,1,)=$A17)*(INDEX(base_index,,1)>=$E$1)*(INDEX(base_index,,1)<=$F$1),INDEX(base_index,,),0))-1","v":1.2779552715654896E-2},{"$f":"SUM(IF((INDEX(base_index,1,)=$A17)*(INDEX(base_index,,1)>=$C$2)*(INDEX(base_index,,1)<=$D$2),INDEX(base_index,,),0))/SUM(IF((INDEX(base_index,1,)=$A17)*(INDEX(base_index,,1)>=$E$2)*(INDEX(base_index,,1)<=$F$2),INDEX(base_index,,),0))-1","v":3.3711217183771014E-2},"https://www.insee.fr/fr/statistiques/serie/001710998",null,"TP05a","Travaux en souterrains traditionnels ",1.4827487881380108E-2,3.409922435240742E-2,"https://www.insee.fr/fr/statistiques/serie/001710991"]
["TP10b",{"$f":"VLOOKUP(A18,'Noms index'!$A$1:$B$23,2,FALSE)","v":"Canalisations sans fourniture de tuyaux"},{"$f":"SUM(IF((INDEX(base_index,1,)=$A18)*(INDEX(base_index,,1)>=$C$1)*(INDEX(base_index,,1)<=$D$1),INDEX(base_index,,),0))/SUM(IF((INDEX(base_index,1,)=$A18)*(INDEX(base_index,,1)>=$E$1)*(INDEX(base_index,,1)<=$F$1),INDEX(base_index,,),0))-1","v":2.0120724346077701E-3},{"$f":"SUM(IF((INDEX(base_index,1,)=$A18)*(INDEX(base_index,,1)>=$C$2)*(INDEX(base_index,,1)<=$D$2),INDEX(base_index,,),0))/SUM(IF((INDEX(base_index,1,)=$A18)*(INDEX(base_index,,1)>=$E$2)*(INDEX(base_index,,1)<=$F$2),INDEX(base_index,,),0))-1","v":1.5158140212796933E-2},"https://www.insee.fr/fr/statistiques/serie/001710999",null,"TP05b","Travaux en souterrains avec tunnelier ",1.3737836290784289E-2,3.0161054172767043E-2,"https://www.insee.fr/fr/statistiques/serie/001710992"]
["TP10c",{"$f":"VLOOKUP(A19,'Noms index'!$A$1:$B$23,2,FALSE)","v":"Réhabilitation de canalisations non visitables"},{"$f":"SUM(IF((INDEX(base_index,1,)=$A19)*(INDEX(base_index,,1)>=$C$1)*(INDEX(base_index,,1)<=$D$1),INDEX(base_index,,),0))/SUM(IF((INDEX(base_index,1,)=$A19)*(INDEX(base_index,,1)>=$E$1)*(INDEX(base_index,,1)<=$F$1),INDEX(base_index,,),0))-1","v":-1.6168148746968924E-3},{"$f":"SUM(IF((INDEX(base_index,1,)=$A19)*(INDEX(base_index,,1)>=$C$2)*(INDEX(base_index,,1)<=$D$2),INDEX(base_index,,),0))/SUM(IF((INDEX(base_index,1,)=$A19)*(INDEX(base_index,,1)>=$E$2)*(INDEX(base_index,,1)<=$F$2),INDEX(base_index,,),0))-1","v":8.4686265906099178E-2},"https://www.insee.fr/fr/statistiques/serie/001711000",null,"TP10a","Canalisations, assainissement et adduction d’eau avec fourniture de tuyaux ",1.2779552715654896E-2,3.3711217183771014E-2,"https://www.insee.fr/fr/statistiques/serie/001710998"]
["TP10d",{"$f":"VLOOKUP(A20,'Noms index'!$A$1:$B$23,2,FALSE)","v":"Réseaux de chauffage et de froid avec fourniture de tuyaux"},{"$f":"SUM(IF((INDEX(base_index,1,)=$A20)*(INDEX(base_index,,1)>=$C$1)*(INDEX(base_index,,1)<=$D$1),INDEX(base_index,,),0))/SUM(IF((INDEX(base_index,1,)=$A20)*(INDEX(base_index,,1)>=$E$1)*(INDEX(base_index,,1)<=$F$1),INDEX(base_index,,),0))-1","v":7.9486395597676562E-3},{"$f":"SUM(IF((INDEX(base_index,1,)=$A20)*(INDEX(base_index,,1)>=$C$2)*(INDEX(base_index,,1)<=$D$2),INDEX(base_index,,),0))/SUM(IF((INDEX(base_index,1,)=$A20)*(INDEX(base_index,,1)>=$E$2)*(INDEX(base_index,,1)<=$F$2),INDEX(base_index,,),0))-1","v":2.4169655387494382E-2},"https://www.insee.fr/fr/statistiques/serie/010605983",null,"TP12a","Réseaux d'énergie et de communication",1.0398613518197708E-2,2.5641025641025772E-2,"https://www.insee.fr/fr/statistiques/serie/001711002"]
["TP11",{"$f":"VLOOKUP(A21,'Noms index'!$A$1:$B$23,2,FALSE)","v":"Canalisations grandes distances de transport / transfert  avec fourniture de tuyaux"},{"$f":"SUM(IF((INDEX(base_index,1,)=$A21)*(INDEX(base_index,,1)>=$C$1)*(INDEX(base_index,,1)<=$D$1),INDEX(base_index,,),0))/SUM(IF((INDEX(base_index,1,)=$A21)*(INDEX(base_index,,1)>=$E$1)*(INDEX(base_index,,1)<=$F$1),INDEX(base_index,,),0))-1","v":2.0788749617853819E-2},{"$f":"SUM(IF((INDEX(base_index,1,)=$A21)*(INDEX(base_index,,1)>=$C$2)*(INDEX(base_index,,1)<=$D$2),INDEX(base_index,,),0))/SUM(IF((INDEX(base_index,1,)=$A21)*(INDEX(base_index,,1)>=$E$2)*(INDEX(base_index,,1)<=$F$2),INDEX(base_index,,),0))-1","v":4.0289581366068639E-2},"https://www.insee.fr/fr/statistiques/serie/001711001",null,"TP12b","Éclairage public -Travaux d'installation",1.012206013694561E-2,2.7701674277016863E-2,"https://www.insee.fr/fr/statistiques/serie/001711003"]
["TP12a",{"$f":"VLOOKUP(A22,'Noms index'!$A$1:$B$23,2,FALSE)","v":"Réseaux d'énergie et de communication"},{"$f":"SUM(IF((INDEX(base_index,1,)=$A22)*(INDEX(base_index,,1)>=$C$1)*(INDEX(base_index,,1)<=$D$1),INDEX(base_index,,),0))/SUM(IF((INDEX(base_index,1,)=$A22)*(INDEX(base_index,,1)>=$E$1)*(INDEX(base_index,,1)<=$F$1),INDEX(base_index,,),0))-1","v":1.0398613518197708E-2},{"$f":"SUM(IF((INDEX(base_index,1,)=$A22)*(INDEX(base_index,,1)>=$C$2)*(INDEX(base_index,,1)<=$D$2),INDEX(base_index,,),0))/SUM(IF((INDEX(base_index,1,)=$A22)*(INDEX(base_index,,1)>=$E$2)*(INDEX(base_index,,1)<=$F$2),INDEX(base_index,,),0))-1","v":2.5641025641025772E-2},"https://www.insee.fr/fr/statistiques/serie/001711002",null,"TP06b","Dragages fluviaux et petits dragages maritimes",9.3233082706767334E-3,2.4850437183616902E-2,"https://www.insee.fr/fr/statistiques/serie/001710994"]
["TP12b",{"$f":"VLOOKUP(A23,'Noms index'!$A$1:$B$23,2,FALSE)","v":"Éclairage public -Travaux d'installation"},{"$f":"SUM(IF((INDEX(base_index,1,)=$A23)*(INDEX(base_index,,1)>=$C$1)*(INDEX(base_index,,1)<=$D$1),INDEX(base_index,,),0))/SUM(IF((INDEX(base_index,1,)=$A23)*(INDEX(base_index,,1)>=$E$1)*(INDEX(base_index,,1)<=$F$1),INDEX(base_index,,),0))-1","v":1.012206013694561E-2},{"$f":"SUM(IF((INDEX(base_index,1,)=$A23)*(INDEX(base_index,,1)>=$C$2)*(INDEX(base_index,,1)<=$D$2),INDEX(base_index,,),0))/SUM(IF((INDEX(base_index,1,)=$A23)*(INDEX(base_index,,1)>=$E$2)*(INDEX(base_index,,1)<=$F$2),INDEX(base_index,,),0))-1","v":2.7701674277016863E-2},"https://www.insee.fr/fr/statistiques/serie/001711003",null,"TP03a","Grands terrassements",8.2620241959281415E-3,2.284340246468286E-2,"https://www.insee.fr/fr/statistiques/serie/001710988"]
["TP12c",{"$f":"VLOOKUP(A24,'Noms index'!$A$1:$B$23,2,FALSE)","v":"Éclairage public - Travaux  de maintenance"},{"$f":"SUM(IF((INDEX(base_index,1,)=$A24)*(INDEX(base_index,,1)>=$C$1)*(INDEX(base_index,,1)<=$D$1),INDEX(base_index,,),0))/SUM(IF((INDEX(base_index,1,)=$A24)*(INDEX(base_index,,1)>=$E$1)*(INDEX(base_index,,1)<=$F$1),INDEX(base_index,,),0))-1","v":-2.3141452126119733E-3},{"$f":"SUM(IF((INDEX(base_index,1,)=$A24)*(INDEX(base_index,,1)>=$C$2)*(INDEX(base_index,,1)<=$D$2),INDEX(base_index,,),0))/SUM(IF((INDEX(base_index,1,)=$A24)*(INDEX(base_index,,1)>=$E$2)*(INDEX(base_index,,1)<=$F$2),INDEX(base_index,,),0))-1","v":3.1958163858221145E-3},"https://www.insee.fr/fr/statistiques/serie/001711004",null,"TP10d","Réseaux de chauffage et de froid avec fourniture de tuyaux",7.9486395597676562E-3,2.4169655387494382E-2,"https://www.insee.fr/fr/statistiques/serie/010605983"]
["TP12d",{"$f":"VLOOKUP(A25,'Noms index'!$A$1:$B$23,2,FALSE)","v":"Réseaux de communication en fibre optique"},{"$f":"SUM(IF((INDEX(base_index,1,)=$A25)*(INDEX(base_index,,1)>=$C$1)*(INDEX(base_index,,1)<=$D$1),INDEX(base_index,,),0))/SUM(IF((INDEX(base_index,1,)=$A25)*(INDEX(base_index,,1)>=$E$1)*(INDEX(base_index,,1)<=$F$1),INDEX(base_index,,),0))-1","v":-2.5936599423630469E-3},{"$f":"SUM(IF((INDEX(base_index,1,)=$A25)*(INDEX(base_index,,1)>=$C$2)*(INDEX(base_index,,1)<=$D$2),INDEX(base_index,,),0))/SUM(IF((INDEX(base_index,1,)=$A25)*(INDEX(base_index,,1)>=$E$2)*(INDEX(base_index,,1)<=$F$2),INDEX(base_index,,),0))-1","v":-1.2968299711815234E-3},"https://www.insee.fr/fr/statistiques/serie/001796841",null,"TP14","Travaux immergés par scaphandriers",5.1413881748070267E-3,1.1818968002306418E-2,"https://www.insee.fr/fr/statistiques/serie/001711006"]
["TP13",{"$f":"VLOOKUP(A26,'Noms index'!$A$1:$B$23,2,FALSE)","v":"Charpentes et ouvrages d’art métalliques "},{"$f":"SUM(IF((INDEX(base_index,1,)=$A26)*(INDEX(base_index,,1)>=$C$1)*(INDEX(base_index,,1)<=$D$1),INDEX(base_index,,),0))/SUM(IF((INDEX(base_index,1,)=$A26)*(INDEX(base_index,,1)>=$E$1)*(INDEX(base_index,,1)<=$F$1),INDEX(base_index,,),0))-1","v":0.12454823463997755},{"$f":"SUM(IF((INDEX(base_index,1,)=$A26)*(INDEX(base_index,,1)>=$C$2)*(INDEX(base_index,,1)<=$D$2),INDEX(base_index,,),0))/SUM(IF((INDEX(base_index,1,)=$A26)*(INDEX(base_index,,1)>=$E$2)*(INDEX(base_index,,1)<=$F$2),INDEX(base_index,,),0))-1","v":0.10242354298903655},"https://www.insee.fr/fr/statistiques/serie/001711005",null,"TP03b","Travaux à l’explosif",4.8455481526348265E-3,1.7365913631473884E-2,"https://www.insee.fr/fr/statistiques/serie/001710988"]
["TP14",{"$f":"VLOOKUP(A27,'Noms index'!$A$1:$B$23,2,FALSE)","v":"Travaux immergés par scaphandriers"},{"$f":"SUM(IF((INDEX(base_index,1,)=$A27)*(INDEX(base_index,,1)>=$C$1)*(INDEX(base_index,,1)<=$D$1),INDEX(base_index,,),0))/SUM(IF((INDEX(base_index,1,)=$A27)*(INDEX(base_index,,1)>=$E$1)*(INDEX(base_index,,1)<=$F$1),INDEX(base_index,,),0))-1","v":5.1413881748070267E-3},{"$f":"SUM(IF((INDEX(base_index,1,)=$A27)*(INDEX(base_index,,1)>=$C$2)*(INDEX(base_index,,1)<=$D$2),INDEX(base_index,,),0))/SUM(IF((INDEX(base_index,1,)=$A27)*(INDEX(base_index,,1)>=$E$2)*(INDEX(base_index,,1)<=$F$2),INDEX(base_index,,),0))-1","v":1.1818968002306418E-2},"https://www.insee.fr/fr/statistiques/serie/001711006",null,"TP10b","Canalisations sans fourniture de tuyaux",2.0120724346077701E-3,1.5158140212796933E-2,"https://www.insee.fr/fr/statistiques/serie/001710999"]
[null,null,null,null,null,null,"TP10c","Réhabilitation de canalisations non visitables",-1.6168148746968924E-3,8.4686265906099178E-2,"https://www.insee.fr/fr/statistiques/serie/001711000"]
[null,null,null,null,null,null,"TP12c","Éclairage public - Travaux  de maintenance",-2.3141452126119733E-3,3.1958163858221145E-3,"https://www.insee.fr/fr/statistiques/serie/001711004"]
[null,null,null,null,null,null,"TP12d","Réseaux de communication en fibre optique",-2.5936599423630469E-3,-1.2968299711815234E-3,"https://www.insee.fr/fr/statistiques/serie/001796841"]

{"sheet":"Résultats depuis janvier","index":15,"n_rows":40,"n_cols":11,"rows_kept":40,"cut":false,"hidden":false,"merged":[[5,10,5,13],[11,6,11,8],[3,5,3,10],[0,1,0,12],[30,0,30,5],[18,5,18,6]]}
[null,{"$f":"\"EVOLUTION DES INDEX ET INDICES TP A FIN \"&'Données à modifier'!A1&\" EN CUMUL DEPUIS JANVIER\"","v":"EVOLUTION DES INDEX ET INDICES TP A FIN OCTOBRE EN CUMUL DEPUIS JANVIER"}]
[null,{"$f":"'Données à modifier'!A3","v":"* /2020 = Cumul janv 2021-oct 2021 / Cumul janv 2020-oct 2020"},null,null,null,null,null,null,{"$f":"'Données à modifier'!A4","v":"* /2019 = Cumul janv 2021-oct 2021 / Cumul janv 2019-oct 2019"}]
[]
["Index souhaité","TP02",null,null,null,{"$f":"B4&\" - \"&VLOOKUP(B4,'Noms index'!$A$1:$B$23,2,FALSE)","v":"TP02 - Travaux de génie civil et d’ouvrages d’art neufs ou rénovation"}]
[]
[{"$f":"\"Evolution du TP01 et du \"&$B$4","v":"Evolution du TP01 et du TP02"},null,null,null,null,null,null,null,null,null,{"$f":"\"Composition globale du \"&B4","v":"Composition globale du TP02"}]
[]
[null,null,null,null,null,null,null,"/ 2019*","/ 2020*"]
[null,null,null,null,null,null,"TP01",{"$f":"SUM(IF((INDEX(base_index,1,)=$G9)*(INDEX(base_index,,1)>='Données cumul depuis janvier'!$B$1)*(INDEX(base_index,,1)<='Données cumul depuis janvier'!$C$1),INDEX(base_index,,),0))/SUM(IF((INDEX(base_index,1,)=$G9)*(INDEX(base_index,,1)>='Données cumul depuis janvier'!$D$1)*(INDEX(base_index,,1)<='Données cumul depuis janvier'!$E$1),INDEX(base_index,,),0))-1","v":3.0316660669305495E-2},{"$f":"SUM(IF((INDEX(base_index,1,)=$G9)*(INDEX(base_index,,1)>='Données cumul depuis janvier'!$B$3)*(INDEX(base_index,,1)<='Données cumul depuis janvier'!$C$3),INDEX(base_index,,),0))/SUM(IF((INDEX(base_index,1,)=$G9)*(INDEX(base_index,,1)>='Données cumul depuis janvier'!$D$3)*(INDEX(base_index,,1)<='Données cumul depuis janvier'!$E$3),INDEX(base_index,,),0))-1","v":4.137115839243477E-2}]
[null,null,null,null,null,null,{"$f":"B4","v":"TP02"},{"$f":"IF(G10=\"TP10d\",\"-\",SUM(IF((INDEX(base_index,1,)=$G10)*(INDEX(base_index,,1)>='Données cumul depuis janvier'!$B$1)*(INDEX(base_index,,1)<='Données cumul depuis janvier'!$C$1),INDEX(base_index,,),0))/SUM(IF((INDEX(base_index,1,)=$G10)*(INDEX(base_index,,1)>='Données cumul depuis janvier'!$D$1)*(INDEX(base_index,,1)<='Données cumul depuis janvier'!$E$1),INDEX(base_index,,),0))-1)","v":5.4217395112551303E-2},{"$f":"SUM(IF((INDEX(base_index,1,)=$G10)*(INDEX(base_index,,1)>='Données cumul depuis janvier'!$B$3)*(INDEX(base_index,,1)<='Données cumul depuis janvier'!$C$3),INDEX(base_index,,),0))/SUM(IF((INDEX(base_index,1,)=$G10)*(INDEX(base_index,,1)>='Données cumul depuis janvier'!$D$3)*(INDEX(base_index,,1)<='Données cumul depuis janvier'!$E$3),INDEX(base_index,,),0))-1","v":5.3202660133006452E-2}]
[]
[null,null,null,null,null,null,{"$f":"\"Part du \"&B4&\" dans le TP01\"","v":"Part du TP02 dans le TP01"}]
[]
[]
[]
[]
[]
["Evolution des indices communs à la plupart des index"]
[null,null,null,null,null,"/ 2020*"]
[null,"/ 2019*","/ 2020*",{"$f":"\"Part dans le \"&B4","v":"Part dans le TP02"}]
["Matériel",{"$f":"SUM(IF((INDEX(base_indices,1,)='Données cumul depuis janvier'!$G5)*(INDEX(base_indices,,1)>='Données cumul depuis janvier'!$B$1)*(INDEX(base_indices,,1)<='Données cumul depuis janvier'!$C$1),INDEX(base_indices,,),0))/SUM(IF((INDEX(base_indices,1,)='Données cumul depuis janvier'!$G5)*(INDEX(base_indices,,1)>='Données cumul depuis janvier'!$D$1)*(INDEX(base_indices,,1)<='Données cumul depuis janvier'!$E$1),INDEX(base_indices,,),0))-1","v":2.0728344584957537E-2},{"$f":"SUM(IF((INDEX(base_indices,1,)='Données cumul depuis janvier'!$G5)*(INDEX(base_indices,,1)>='Données cumul depuis janvier'!$B$3)*(INDEX(base_indices,,1)<='Données cumul depuis janvier'!$C$3),INDEX(base_indices,,),0))/SUM(IF((INDEX(base_indices,1,)='Données cumul depuis janvier'!$G5)*(INDEX(base_indices,,1)>='Données cumul depuis janvier'!$D$3)*(INDEX(base_indices,,1)<='Données cumul depuis janvier'!$E$3),INDEX(base_indices,,),0))-1","v":2.9439969313387104E-2},{"$f":"SUM(IF((INDEX(compo,3,)='Données cumul depuis janvier'!G$5)*(INDEX(compo,,1)=$B$4),INDEX(compo,,),0))","v":0.15}]
["Travail",{"$f":"SUM(IF((INDEX(base_indices,1,)='Données cumul depuis janvier'!$G6)*(INDEX(base_indices,,1)>='Données cumul depuis janvier'!$B$1)*(INDEX(base_indices,,1)<='Données cumul depuis janvier'!$C$1),INDEX(base_indices,,),0))/SUM(IF((INDEX(base_indices,1,)='Données cumul depuis janvier'!$G6)*(INDEX(base_indices,,1)>='Données cumul depuis janvier'!$D$1)*(INDEX(base_indices,,1)<='Données cumul depuis janvier'!$E$1),INDEX(base_indices,,),0))-1","v":3.4299714169048201E-3},{"$f":"SUM(IF((INDEX(base_indices,1,)='Données cumul depuis janvier'!$G6)*(INDEX(base_indices,,1)>='Données cumul depuis janvier'!$B$3)*(INDEX(base_indices,,1)<='Données cumul depuis janvier'!$C$3),INDEX(base_indices,,),0))/SUM(IF((INDEX(base_indices,1,)='Données cumul depuis janvier'!$G6)*(INDEX(base_indices,,1)>='Données cumul depuis janvier'!$D$3)*(INDEX(base_indices,,1)<='Données cumul depuis janvier'!$E$3),INDEX(base_indices,,),0))-1","v":-6.3081277800242086E-3},{"$f":"SUM(IF((INDEX(compo,3,)='Données cumul depuis janvier'!G6)*(INDEX(compo,,1)=$B$4),INDEX(compo,,),0))","v":0.55000000000000004}]
["GNR",{"$f":"SUM(IF((INDEX(base_indices,1,)='Données cumul depuis janvier'!$G7)*(INDEX(base_indices,,1)>='Données cumul depuis janvier'!$B$1)*(INDEX(base_indices,,1)<='Données cumul depuis janvier'!$C$1),INDEX(base_indices,,),0))/SUM(IF((INDEX(base_indices,1,)='Données cumul depuis janvier'!$G7)*(INDEX(base_indices,,1)>='Données cumul depuis janvier'!$D$1)*(INDEX(base_indices,,1)<='Données cumul depuis janvier'!$E$1),INDEX(base_indices,,),0))-1","v":-4.6673205819846464E-2},{"$f":"SUM(IF((INDEX(base_indices,1,)='Données cumul depuis janvier'!$G7)*(INDEX(base_indices,,1)>='Données cumul depuis janvier'!$B$3)*(INDEX(base_indices,,1)<='Données cumul depuis janvier'!$C$3),INDEX(base_indices,,),0))/SUM(IF((INDEX(base_indices,1,)='Données cumul depuis janvier'!$G7)*(INDEX(base_indices,,1)>='Données cumul depuis janvier'!$D$3)*(INDEX(base_indices,,1)<='Données cumul depuis janvier'!$E$3),INDEX(base_indices,,),0))-1","v":0.16641664166416636},{"$f":"SUM(IF((INDEX(compo,3,)='Données cumul depuis janvier'!G7)*(INDEX(compo,,1)=$B$4),INDEX(compo,,),0))","v":0}]
["Gazole",{"$f":"SUM(IF((INDEX(base_indices,1,)='Données cumul depuis janvier'!$G8)*(INDEX(base_indices,,1)>='Données cumul depuis janvier'!$B$1)*(INDEX(base_indices,,1)<='Données cumul depuis janvier'!$C$1),INDEX(base_indices,,),0))/SUM(IF((INDEX(base_indices,1,)='Données cumul depuis janvier'!$G8)*(INDEX(base_indices,,1)>='Données cumul depuis janvier'!$D$1)*(INDEX(base_indices,,1)<='Données cumul depuis janvier'!$E$1),INDEX(base_indices,,),0))-1","v":-3.0775527236542199E-2},{"$f":"SUM(IF((INDEX(base_indices,1,)='Données cumul depuis janvier'!$G8)*(INDEX(base_indices,,1)>='Données cumul depuis janvier'!$B$3)*(INDEX(base_indices,,1)<='Données cumul depuis janvier'!$C$3),INDEX(base_indices,,),0))/SUM(IF((INDEX(base_indices,1,)='Données cumul depuis janvier'!$G8)*(INDEX(base_indices,,1)>='Données cumul depuis janvier'!$D$3)*(INDEX(base_indices,,1)<='Données cumul depuis janvier'!$E$3),INDEX(base_indices,,),0))-1","v":0.10335912591469243},{"$f":"SUM(IF((INDEX(compo,3,)='Données cumul depuis janvier'!G8)*(INDEX(compo,,1)=$B$4),INDEX(compo,,),0))","v":0}]
["Frais divers",{"$f":"SUM(IF((INDEX(base_indices,1,)='Données cumul depuis janvier'!$G9)*(INDEX(base_indices,,1)>='Données cumul depuis janvier'!$B$1)*(INDEX(base_indices,,1)<='Données cumul depuis janvier'!$C$1),INDEX(base_indices,,),0))/SUM(IF((INDEX(base_indices,1,)='Données cumul depuis janvier'!$G9)*(INDEX(base_indices,,1)>='Données cumul depuis janvier'!$D$1)*(INDEX(base_indices,,1)<='Données cumul depuis janvier'!$E$1),INDEX(base_indices,,),0))-1","v":1.3347519102427929E-2},{"$f":"SUM(IF((INDEX(base_indices,1,)='Données cumul depuis janvier'!$G9)*(INDEX(base_indices,,1)>='Données cumul depuis janvier'!$B$3)*(INDEX(base_indices,,1)<='Données cumul depuis janvier'!$C$3),INDEX(base_indices,,),0))/SUM(IF((INDEX(base_indices,1,)='Données cumul depuis janvier'!$G9)*(INDEX(base_indices,,1)>='Données cumul depuis janvier'!$D$3)*(INDEX(base_indices,,1)<='Données cumul depuis janvier'!$E$3),INDEX(base_indices,,),0))-1","v":1.2368344767610395E-2},{"$f":"SUM(IF((INDEX(compo,3,)='Données cumul depuis janvier'!G9)*(INDEX(compo,,1)=$B$4),INDEX(compo,,),0))","v":0.01}]
["Transport",{"$f":"SUM(IF((INDEX(base_indices,1,)='Données cumul depuis janvier'!$G10)*(INDEX(base_indices,,1)>='Données cumul depuis janvier'!$B$1)*(INDEX(base_indices,,1)<='Données cumul depuis janvier'!$C$1),INDEX(base_indices,,),0))/SUM(IF((INDEX(base_indices,1,)='Données cumul depuis janvier'!$G10)*(INDEX(base_indices,,1)>='Données cumul depuis janvier'!$D$1)*(INDEX(base_indices,,1)<='Données cumul depuis janvier'!$E$1),INDEX(base_indices,,),0))-1","v":4.5708017186214533E-3},{"$f":"SUM(IF((INDEX(base_indices,1,)='Données cumul depuis janvier'!$G10)*(INDEX(base_indices,,1)>='Données cumul depuis janvier'!$B$3)*(INDEX(base_indices,,1)<='Données cumul depuis janvier'!$C$3),INDEX(base_indices,,),0))/SUM(IF((INDEX(base_indices,1,)='Données cumul depuis janvier'!$G10)*(INDEX(base_indices,,1)>='Données cumul depuis janvier'!$D$3)*(INDEX(base_indices,,1)<='Données cumul depuis janvier'!$E$3),INDEX(base_indices,,),0))-1","v":3.2867707477404196E-3},{"$f":"SUM(IF((INDEX(compo,3,)='Données cumul depuis janvier'!G10)*(INDEX(compo,,1)=$B$4),INDEX(compo,,),0))","v":0.01}]
["Ensemble hors matériaux",null,null,{"$f":"SUM(D21:D26)","v":0.72000000000000008}]
[]
[{"$f":"IF(B4=\"TP14\",\"Frais divers hors Restaurants et hôtels\",IF(OR(B4=\"TP03a\",B4=\"TP03b\",B4=\"TP12d\"),\"Travail hors travail activités spécialisées\",\"\"))","v":""}]
[{"$f":"\"Evolution des indices spécifiques au \"&B4","v":"Evolution des indices spécifiques au TP02"}]
[{"$f":"IF(ISNA(VLOOKUP($B$4,'Indice prix'!$A$69:$B$74,2,FALSE)),\"\",VLOOKUP($B$4,'Indice prix'!$A$69:$B$74,2,FALSE))","v":""},null,null,null,null,null,{"$f":"IF(A32=\"\",\"\",\"/ 2019*\")","v":"/ 2019*"},{"$f":"IF(A32=\"\",\"\",\"/ 2020*\")","v":"/ 2020*"},{"$f":"IF(A32=\"\",\"\",\"Part dans le \"&B4)","v":"Part dans le TP02"}]
[{"$f":"IF('Données cumul depuis janvier'!D54<>0,'Données cumul depuis janvier'!C54,\"\")","v":"Béton prêt à l'emploi"},null,null,null,null,null,{"$f":"IF('Données cumul depuis janvier'!$D54<>0,'Données cumul depuis janvier'!F54,\"\")","v":1.3541865344268489E-2},{"$f":"IF('Données cumul depuis janvier'!$D54<>0,'Données cumul depuis janvier'!G54,\"\")","v":1.383191834398545E-2},{"$f":"IF('Données cumul depuis janvier'!D54<>0,'Données cumul depuis janvier'!D54,\"\")","v":0.12}]
[{"$f":"IF('Données cumul depuis janvier'!D55<>0,'Données cumul depuis janvier'!C55,\"\")","v":"Barres crénelées ou nervurées pour béton armé"},null,null,null,null,null,{"$f":"IF('Données cumul depuis janvier'!$D55<>0,'Données cumul depuis janvier'!F55,\"\")","v":0.36126215191959177},{"$f":"IF('Données cumul depuis janvier'!$D55<>0,'Données cumul depuis janvier'!G55,\"\")","v":0.49380706988518241},{"$f":"IF('Données cumul depuis janvier'!D55<>0,'Données cumul depuis janvier'!D55,\"\")","v":0.09}]
[{"$f":"IF('Données cumul depuis janvier'!D56<>0,'Données cumul depuis janvier'!C56,\"\")","v":"Tubes, tuyaux en matière plastique"},null,null,null,null,null,{"$f":"IF('Données cumul depuis janvier'!$D56<>0,'Données cumul depuis janvier'!F56,\"\")","v":0.11908809119088093},{"$f":"IF('Données cumul depuis janvier'!$D56<>0,'Données cumul depuis janvier'!G56,\"\")","v":0.12234255916566394},{"$f":"IF('Données cumul depuis janvier'!D56<>0,'Données cumul depuis janvier'!D56,\"\")","v":0.04}]
[{"$f":"IF('Données cumul depuis janvier'!D57<>0,'Données cumul depuis janvier'!C57,\"\")","v":"Ensemble des produits du sciage"},null,null,null,null,null,{"$f":"IF('Données cumul depuis janvier'!$D57<>0,'Données cumul depuis janvier'!F57,\"\")","v":0.15890939135224502},{"$f":"IF('Données cumul depuis janvier'!$D57<>0,'Données cumul depuis janvier'!G57,\"\")","v":0.17970283151107402},{"$f":"IF('Données cumul depuis janvier'!D57<>0,'Données cumul depuis janvier'!D57,\"\")","v":0.02}]
[{"$f":"IF('Données cumul depuis janvier'!D58<>0,'Données cumul depuis janvier'!C58,\"\")","v":"Électricité vendue aux entreprises consommatrices finales"},null,null,null,null,null,{"$f":"IF('Données cumul depuis janvier'!$D58<>0,'Données cumul depuis janvier'!F58,\"\")","v":8.3452211126961551E-2},{"$f":"IF('Données cumul depuis janvier'!$D58<>0,'Données cumul depuis janvier'!G58,\"\")","v":3.987677562895775E-2},{"$f":"IF('Données cumul depuis janvier'!D58<>0,'Données cumul depuis janvier'!D58,\"\")","v":0.01}]
[{"$f":"IF('Données cumul depuis janvier'!D59<>0,'Données cumul depuis janvier'!C59,\"\")","v":""},null,null,null,null,null,{"$f":"IF('Données cumul depuis janvier'!$D59<>0,'Données cumul depuis janvier'!F59,\"\")","v":""},{"$f":"IF('Données cumul depuis janvier'!$D59<>0,'Données cumul depuis janvier'!G59,\"\")","v":""},{"$f":"IF('Données cumul depuis janvier'!D59<>0,'Données cumul depuis janvier'!D59,\"\")","v":""}]
[{"$f":"IF('Données cumul depuis janvier'!D60<>0,'Données cumul depuis janvier'!C60,\"\")","v":""},null,null,null,null,null,{"$f":"IF('Données cumul depuis janvier'!$D60<>0,'Données cumul depuis janvier'!F60,\"\")","v":""},{"$f":"IF('Données cumul depuis janvier'!$D60<>0,'Données cumul depuis janvier'!G60,\"\")","v":""},{"$f":"IF('Données cumul depuis janvier'!D60<>0,'Données cumul depuis janvier'!D60,\"\")","v":""}]
[{"$f":"IF('Données cumul depuis janvier'!D61<>0,'Données cumul depuis janvier'!C61,\"\")","v":""},null,null,null,null,null,{"$f":"IF('Données cumul depuis janvier'!$D61<>0,'Données cumul depuis janvier'!F61,\"\")","v":""},{"$f":"IF('Données cumul depuis janvier'!$D61<>0,'Données cumul depuis janvier'!G61,\"\")","v":""},{"$f":"IF('Données cumul depuis janvier'!D61<>0,'Données cumul depuis janvier'!D61,\"\")","v":""}]
[{"$f":"IF('Données cumul depuis janvier'!D62<>0,'Données cumul depuis janvier'!C62,\"\")","v":""},null,null,null,null,null,{"$f":"IF('Données cumul depuis janvier'!$D62<>0,'Données cumul depuis janvier'!F62,\"\")","v":""},{"$f":"IF('Données cumul depuis janvier'!$D62<>0,'Données cumul depuis janvier'!G62,\"\")","v":""},{"$f":"IF('Données cumul depuis janvier'!D62<>0,'Données cumul depuis janvier'!D62,\"\")","v":""},{"$f":"IF(OR(A32=\"Travail activités spécialisées\",A32=\"Fils et câbles d'énergie\",A32=\"Tuyaux d'assainissement\"),\"juillet 2021 = juin 2021\",\"\")","v":""}]

{"sheet":"Résultats 3-6 mois glissants","index":16,"n_rows":40,"n_cols":11,"rows_kept":40,"cut":false,"hidden":false,"merged":[[30,0,30,5],[0,1,0,12],[3,5,3,10],[5,10,5,13],[11,6,11,8],[18,5,18,6]]}
[null,{"$f":"\"EVOLUTION DES INDEX ET INDICES TP A FIN \"&'Données à modifier'!A1&\" EN GLISSEMENT 3 MOIS ET 6 MOIS\"","v":"EVOLUTION DES INDEX ET INDICES TP A FIN OCTOBRE EN GLISSEMENT 3 MOIS ET 6 MOIS"}]
[null,{"$f":"'Index 3-6 mois glissants'!H1","v":"* 3 mois = août 2021-oct 2021 / mai 2021-juil 2021"},null,null,null,null,null,null,{"$f":"'Index 3-6 mois glissants'!H2","v":"* 6 mois = mai 2021-oct 2021 / nov 2020-avr 2021"}]
[]
["Index souhaité","TP02",null,null,null,{"$f":"B4&\" - \"&VLOOKUP(B4,'Noms index'!$A$1:$B$23,2,FALSE)","v":"TP02 - Travaux de génie civil et d’ouvrages d’art neufs ou rénovation"}]
[]
[{"$f":"\"Evolution du TP01 et du \"&$B$4","v":"Evolution du TP01 et du TP02"},null,null,null,null,null,null,null,null,null,{"$f":"\"Composition globale du \"&B4","v":"Composition globale du TP02"}]
[]
[null,null,null,null,null,null,null,"3 mois*","6 mois*"]
[null,null,null,null,null,null,"TP01",{"$f":"SUM(IF((INDEX(base_index,1,)=$G9)*(INDEX(base_index,,1)>='Données 3-6 mois glissants'!$B$1)*(INDEX(base_index,,1)<='Données 3-6 mois glissants'!$C$1),INDEX(base_index,,),0))/SUM(IF((INDEX(base_index,1,)=$G9)*(INDEX(base_index,,1)>='Données 3-6 mois glissants'!$D$1)*(INDEX(base_index,,1)<='Données 3-6 mois glissants'!$E$1),INDEX(base_index,,),0))-1","v":1.5375689004931692E-2},{"$f":"SUM(IF((INDEX(base_index,1,)=$G9)*(INDEX(base_index,,1)>='Données 3-6 mois glissants'!$B$3)*(INDEX(base_index,,1)<='Données 3-6 mois glissants'!$C$3),INDEX(base_index,,),0))/SUM(IF((INDEX(base_index,1,)=$G9)*(INDEX(base_index,,1)>='Données 3-6 mois glissants'!$D$3)*(INDEX(base_index,,1)<='Données 3-6 mois glissants'!$E$3),INDEX(base_index,,),0))-1","v":3.7020450813554318E-2}]
[null,null,null,null,null,null,{"$f":"B4","v":"TP02"},{"$f":"SUM(IF((INDEX(base_index,1,)=$G10)*(INDEX(base_index,,1)>='Données 3-6 mois glissants'!$B$1)*(INDEX(base_index,,1)<='Données 3-6 mois glissants'!$C$1),INDEX(base_index,,),0))/SUM(IF((INDEX(base_index,1,)=$G10)*(INDEX(base_index,,1)>='Données 3-6 mois glissants'!$D$1)*(INDEX(base_index,,1)<='Données 3-6 mois glissants'!$E$1),INDEX(base_index,,),0))-1","v":2.1793103448275897E-2},{"$f":"SUM(IF((INDEX(base_index,1,)=$G10)*(INDEX(base_index,,1)>='Données 3-6 mois glissants'!$B$3)*(INDEX(base_index,,1)<='Données 3-6 mois glissants'!$C$3),INDEX(base_index,,),0))/SUM(IF((INDEX(base_index,1,)=$G10)*(INDEX(base_index,,1)>='Données 3-6 mois glissants'!$D$3)*(INDEX(base_index,,1)<='Données 3-6 mois glissants'!$E$3),INDEX(base_index,,),0))-1","v":4.6850449935723626E-2}]
[]
[null,null,null,null,null,null,{"$f":"\"Part du \"&B4&\" dans le TP01\"","v":"Part du TP02 dans le TP01"}]
[]
[]
[]
[]
[]
["Evolution des indices communs à la plupart des index"]
[null,null,null,null,null,"3 mois*"]
[null,"3 mois*","6 mois*",{"$f":"\"Part dans le \"&B4","v":"Part dans le TP02"}]
["Matériel",{"$f":"SUM(IF((INDEX(base_indices,1,)='Données 3-6 mois glissants'!$D5)*(INDEX(base_indices,,1)>='Données 3-6 mois glissants'!$B$1)*(INDEX(base_indices,,1)<='Données 3-6 mois glissants'!$C$1),INDEX(base_indices,,),0))/SUM(IF((INDEX(base_indices,1,)='Données 3-6 mois glissants'!$D5)*(INDEX(base_indices,,1)>='Données 3-6 mois glissants'!$D$1)*(INDEX(base_indices,,1)<='Données 3-6 mois glissants'!$E$1),INDEX(base_indices,,),0))-1","v":7.7327559542221813E-3},{"$f":"SUM(IF((INDEX(base_indices,1,)='Données 3-6 mois glissants'!$D5)*(INDEX(base_indices,,1)>='Données 3-6 mois glissants'!$B$3)*(INDEX(base_indices,,1)<='Données 3-6 mois glissants'!$C$3),INDEX(base_indices,,),0))/SUM(IF((INDEX(base_indices,1,)='Données 3-6 mois glissants'!$D5)*(INDEX(base_indices,,1)>='Données 3-6 mois glissants'!$D$3)*(INDEX(base_indices,,1)<='Données 3-6 mois glissants'!$E$3),INDEX(base_indices,,),0))-1","v":2.5110549589387299E-2},{"$f":"SUM(IF((INDEX(compo,3,)='Données 3-6 mois glissants'!D$5)*(INDEX(compo,,1)=$B$4),INDEX(compo,,),0))","v":0.15}]
["Travail",{"$f":"SUM(IF((INDEX(base_indices,1,)='Données 3-6 mois glissants'!$D6)*(INDEX(base_indices,,1)>='Données 3-6 mois glissants'!$B$1)*(INDEX(base_indices,,1)<='Données 3-6 mois glissants'!$C$1),INDEX(base_indices,,),0))/SUM(IF((INDEX(base_indices,1,)='Données 3-6 mois glissants'!$D6)*(INDEX(base_indices,,1)>='Données 3-6 mois glissants'!$D$1)*(INDEX(base_indices,,1)<='Données 3-6 mois glissants'!$E$1),INDEX(base_indices,,),0))-1","v":8.1588251291808689E-4},{"$f":"SUM(IF((INDEX(base_indices,1,)='Données 3-6 mois glissants'!$D6)*(INDEX(base_indices,,1)>='Données 3-6 mois glissants'!$B$3)*(INDEX(base_indices,,1)<='Données 3-6 mois glissants'!$C$3),INDEX(base_indices,,),0))/SUM(IF((INDEX(base_indices,1,)='Données 3-6 mois glissants'!$D6)*(INDEX(base_indices,,1)>='Données 3-6 mois glissants'!$D$3)*(INDEX(base_indices,,1)<='Données 3-6 mois glissants'!$E$3),INDEX(base_indices,,),0))-1","v":-5.6764427625354275E-3},{"$f":"SUM(IF((INDEX(compo,3,)='Données 3-6 mois glissants'!D6)*(INDEX(compo,,1)=$B$4),INDEX(compo,,),0))","v":0.55000000000000004}]
["GNR",{"$f":"SUM(IF((INDEX(base_indices,1,)='Données 3-6 mois glissants'!$D7)*(INDEX(base_indices,,1)>='Données 3-6 mois glissants'!$B$1)*(INDEX(base_indices,,1)<='Données 3-6 mois glissants'!$C$1),INDEX(base_indices,,),0))/SUM(IF((INDEX(base_indices,1,)='Données 3-6 mois glissants'!$D7)*(INDEX(base_indices,,1)>='Données 3-6 mois glissants'!$D$1)*(INDEX(base_indices,,1)<='Données 3-6 mois glissants'!$E$1),INDEX(base_indices,,),0))-1","v":7.9509831860929081E-2},{"$f":"SUM(IF((INDEX(base_indices,1,)='Données 3-6 mois glissants'!$D7)*(INDEX(base_indices,,1)>='Données 3-6 mois glissants'!$B$3)*(INDEX(base_indices,,1)<='Données 3-6 mois glissants'!$C$3),INDEX(base_indices,,),0))/SUM(IF((INDEX(base_indices,1,)='Données 3-6 mois glissants'!$D7)*(INDEX(base_indices,,1)>='Données 3-6 mois glissants'!$D$3)*(INDEX(base_indices,,1)<='Données 3-6 mois glissants'!$E$3),INDEX(base_indices,,),0))-1","v":0.1502206809583857},{"$f":"SUM(IF((INDEX(compo,3,)='Données 3-6 mois glissants'!D7)*(INDEX(compo,,1)=$B$4),INDEX(compo,,),0))","v":0}]
["Gazole",{"$f":"SUM(IF((INDEX(base_indices,1,)='Données 3-6 mois glissants'!$D8)*(INDEX(base_indices,,1)>='Données 3-6 mois glissants'!$B$1)*(INDEX(base_indices,,1)<='Données 3-6 mois glissants'!$C$1),INDEX(base_indices,,),0))/SUM(IF((INDEX(base_indices,1,)='Données 3-6 mois glissants'!$D8)*(INDEX(base_indices,,1)>='Données 3-6 mois glissants'!$D$1)*(INDEX(base_indices,,1)<='Données 3-6 mois glissants'!$E$1),INDEX(base_indices,,),0))-1","v":4.2386142147308403E-2},{"$f":"SUM(IF((INDEX(base_indices,1,)='Données 3-6 mois glissants'!$D8)*(INDEX(base_indices,,1)>='Données 3-6 mois glissants'!$B$3)*(INDEX(base_indices,,1)<='Données 3-6 mois glissants'!$C$3),INDEX(base_indices,,),0))/SUM(IF((INDEX(base_indices,1,)='Données 3-6 mois glissants'!$D8)*(INDEX(base_indices,,1)>='Données 3-6 mois glissants'!$D$3)*(INDEX(base_indices,,1)<='Données 3-6 mois glissants'!$E$3),INDEX(base_indices,,),0))-1","v":9.8709277254334316E-2},{"$f":"SUM(IF((INDEX(compo,3,)='Données 3-6 mois glissants'!D8)*(INDEX(compo,,1)=$B$4),INDEX(compo,,),0))","v":0}]
["Frais divers",{"$f":"SUM(IF((INDEX(base_indices,1,)='Données 3-6 mois glissants'!$D9)*(INDEX(base_indices,,1)>='Données 3-6 mois glissants'!$B$1)*(INDEX(base_indices,,1)<='Données 3-6 mois glissants'!$C$1),INDEX(base_indices,,),0))/SUM(IF((INDEX(base_indices,1,)='Données 3-6 mois glissants'!$D9)*(INDEX(base_indices,,1)>='Données 3-6 mois glissants'!$D$1)*(INDEX(base_indices,,1)<='Données 3-6 mois glissants'!$E$1),INDEX(base_indices,,),0))-1","v":6.0126582278481333E-3},{"$f":"SUM(IF((INDEX(base_indices,1,)='Données 3-6 mois glissants'!$D9)*(INDEX(base_indices,,1)>='Données 3-6 mois glissants'!$B$3)*(INDEX(base_indices,,1)<='Données 3-6 mois glissants'!$C$3),INDEX(base_indices,,),0))/SUM(IF((INDEX(base_indices,1,)='Données 3-6 mois glissants'!$D9)*(INDEX(base_indices,,1)>='Données 3-6 mois glissants'!$D$3)*(INDEX(base_indices,,1)<='Données 3-6 mois glissants'!$E$3),INDEX(base_indices,,),0))-1","v":2.2254475084663605E-2},{"$f":"SUM(IF((INDEX(compo,3,)='Données 3-6 mois glissants'!D9)*(INDEX(compo,,1)=$B$4),INDEX(compo,,),0))","v":0.01}]
["Transport",{"$f":"SUM(IF((INDEX(base_indices,1,)='Données 3-6 mois glissants'!$D10)*(INDEX(base_indices,,1)>='Données 3-6 mois glissants'!$B$1)*(INDEX(base_indices,,1)<='Données 3-6 mois glissants'!$C$1),INDEX(base_indices,,),0))/SUM(IF((INDEX(base_indices,1,)='Données 3-6 mois glissants'!$D10)*(INDEX(base_indices,,1)>='Données 3-6 mois glissants'!$D$1)*(INDEX(base_indices,,1)<='Données 3-6 mois glissants'!$E$1),INDEX(base_indices,,),0))-1","v":2.721499848805653E-3},{"$f":"SUM(IF((INDEX(base_indices,1,)='Données 3-6 mois glissants'!$D10)*(INDEX(base_indices,,1)>='Données 3-6 mois glissants'!$B$3)*(INDEX(base_indices,,1)<='Données 3-6 mois glissants'!$C$3),INDEX(base_indices,,),0))/SUM(IF((INDEX(base_indices,1,)='Données 3-6 mois glissants'!$D10)*(INDEX(base_indices,,1)>='Données 3-6 mois glissants'!$D$3)*(INDEX(base_indices,,1)<='Données 3-6 mois glissants'!$E$3),INDEX(base_indices,,),0))-1","v":1.2381534698868712E-2},{"$f":"SUM(IF((INDEX(compo,3,)='Données 3-6 mois glissants'!D10)*(INDEX(compo,,1)=$B$4),INDEX(compo,,),0))","v":0.01}]
["Ensemble hors matériaux",null,null,{"$f":"SUM(D21:D26)","v":0.72000000000000008}]
[]
[{"$f":"IF(B4=\"TP14\",\"Frais divers hors Restaurants et hôtels\",IF(OR(B4=\"TP03a\",B4=\"TP03b\",B4=\"TP12d\"),\"Travail hors travail activités spécialisées\",\"\"))","v":""}]
[{"$f":"\"Evolution des indices spécifiques au \"&B4","v":"Evolution des indices spécifiques au TP02"}]
[{"$f":"IF(ISNA(VLOOKUP($B$4,'Indice prix'!$A$69:$B$74,2,FALSE)),\"\",VLOOKUP($B$4,'Indice prix'!$A$69:$B$74,2,FALSE))","v":""},null,null,null,null,null,{"$f":"IF(A32=\"\",\"\",\"3 mois*\")","v":"3 mois*"},{"$f":"IF(A32=\"\",\"\",\"6 mois*\")","v":"6 mois*"},{"$f":"IF(A32=\"\",\"\",\"Part dans le \"&B4)","v":"Part dans le TP02"}]
[{"$f":"IF('Données 3-6 mois glissants'!D54<>0,'Données 3-6 mois glissants'!C54,\"\")","v":"Béton prêt à l'emploi"},null,null,null,null,null,{"$f":"IF('Données 3-6 mois glissants'!$D54<>0,'Données 3-6 mois glissants'!F54,\"\")","v":5.969211435752575E-3},{"$f":"IF('Données 3-6 mois glissants'!$D54<>0,'Données 3-6 mois glissants'!G54,\"\")","v":6.4627994955861467E-3},{"$f":"IF('Données 3-6 mois glissants'!D54<>0,'Données 3-6 mois glissants'!D54,\"\")","v":0.12}]
[{"$f":"IF('Données 3-6 mois glissants'!D55<>0,'Données 3-6 mois glissants'!C55,\"\")","v":"Barres crénelées ou nervurées pour béton armé"},null,null,null,null,null,{"$f":"IF('Données 3-6 mois glissants'!$D55<>0,'Données 3-6 mois glissants'!F55,\"\")","v":0.14697178930755572},{"$f":"IF('Données 3-6 mois glissants'!$D55<>0,'Données 3-6 mois glissants'!G55,\"\")","v":0.37290273747950042},{"$f":"IF('Données 3-6 mois glissants'!D55<>0,'Données 3-6 mois glissants'!D55,\"\")","v":0.09}]
[{"$f":"IF('Données 3-6 mois glissants'!D56<>0,'Données 3-6 mois glissants'!C56,\"\")","v":"Tubes, tuyaux en matière plastique"},null,null,null,null,null,{"$f":"IF('Données 3-6 mois glissants'!$D56<>0,'Données 3-6 mois glissants'!F56,\"\")","v":7.8334304018637058E-2},{"$f":"IF('Données 3-6 mois glissants'!$D56<>0,'Données 3-6 mois glissants'!G56,\"\")","v":0.18397478433974768},{"$f":"IF('Données 3-6 mois glissants'!D56<>0,'Données 3-6 mois glissants'!D56,\"\")","v":0.04}]
[{"$f":"IF('Données 3-6 mois glissants'!D57<>0,'Données 3-6 mois glissants'!C57,\"\")","v":"Ensemble des produits du sciage"},null,null,null,null,null,{"$f":"IF('Données 3-6 mois glissants'!$D57<>0,'Données 3-6 mois glissants'!F57,\"\")","v":7.1614583333333259E-2},{"$f":"IF('Données 3-6 mois glissants'!$D57<>0,'Données 3-6 mois glissants'!G57,\"\")","v":0.16199240432369266},{"$f":"IF('Données 3-6 mois glissants'!D57<>0,'Données 3-6 mois glissants'!D57,\"\")","v":0.02}]
[{"$f":"IF('Données 3-6 mois glissants'!D58<>0,'Données 3-6 mois glissants'!C58,\"\")","v":"Électricité vendue aux entreprises consommatrices finales"},null,null,null,null,null,{"$f":"IF('Données 3-6 mois glissants'!$D58<>0,'Données 3-6 mois glissants'!F58,\"\")","v":-2.1034180543383019E-2},{"$f":"IF('Données 3-6 mois glissants'!$D58<>0,'Données 3-6 mois glissants'!G58,\"\")","v":-0.13398107900792633},{"$f":"IF('Données 3-6 mois glissants'!D58<>0,'Données 3-6 mois glissants'!D58,\"\")","v":0.01}]
[{"$f":"IF('Données 3-6 mois glissants'!D59<>0,'Données 3-6 mois glissants'!C59,\"\")","v":""},null,null,null,null,null,{"$f":"IF('Données 3-6 mois glissants'!$D59<>0,'Données 3-6 mois glissants'!F59,\"\")","v":""},{"$f":"IF('Données 3-6 mois glissants'!$D59<>0,'Données 3-6 mois glissants'!G59,\"\")","v":""},{"$f":"IF('Données 3-6 mois glissants'!D59<>0,'Données 3-6 mois glissants'!D59,\"\")","v":""}]
[{"$f":"IF('Données 3-6 mois glissants'!D60<>0,'Données 3-6 mois glissants'!C60,\"\")","v":""},null,null,null,null,null,{"$f":"IF('Données 3-6 mois glissants'!$D60<>0,'Données 3-6 mois glissants'!F60,\"\")","v":""},{"$f":"IF('Données 3-6 mois glissants'!$D60<>0,'Données 3-6 mois glissants'!G60,\"\")","v":""},{"$f":"IF('Données 3-6 mois glissants'!D60<>0,'Données 3-6 mois glissants'!D60,\"\")","v":""}]
[{"$f":"IF('Données 3-6 mois glissants'!D61<>0,'Données 3-6 mois glissants'!C61,\"\")","v":""},null,null,null,null,null,{"$f":"IF('Données 3-6 mois glissants'!$D61<>0,'Données 3-6 mois glissants'!F61,\"\")","v":""},{"$f":"IF('Données 3-6 mois glissants'!$D61<>0,'Données 3-6 mois glissants'!G61,\"\")","v":""},{"$f":"IF('Données 3-6 mois glissants'!D61<>0,'Données 3-6 mois glissants'!D61,\"\")","v":""}]
[{"$f":"IF('Données 3-6 mois glissants'!D62<>0,'Données 3-6 mois glissants'!C62,\"\")","v":""},null,null,null,null,null,{"$f":"IF('Données 3-6 mois glissants'!$D62<>0,'Données 3-6 mois glissants'!F62,\"\")","v":""},{"$f":"IF('Données 3-6 mois glissants'!$D62<>0,'Données 3-6 mois glissants'!G62,\"\")","v":""},{"$f":"IF('Données 3-6 mois glissants'!D62<>0,'Données 3-6 mois glissants'!D62,\"\")","v":""},{"$f":"IF(OR(A32=\"Travail activités spécialisées\",A32=\"Fils et câbles d'énergie\",A32=\"Tuyaux d'assainissement\"),\"juillet 2021 = juin 2021\",\"\")","v":""}]

{"sheet":"Evol indices depuis janvier","index":17,"n_rows":49,"n_cols":4,"rows_kept":49,"cut":false,"hidden":false,"merged":[[48,0,49,3],[50,0,51,3]]}
[{"$f":"\"CLASSEMENT DES INDICES SELON LEUR ÉVOLUTION A FIN \"&'Données à modifier'!A1&\" EN CUMUL DEPUIS JANVIER PAR RAPPORT À 2020\"","v":"CLASSEMENT DES INDICES SELON LEUR ÉVOLUTION A FIN OCTOBRE EN CUMUL DEPUIS JANVIER PAR RAPPORT À 2020"}]
[]
[{"$f":"'Données à modifier'!A3&\"          \"&'Données à modifier'!A4","v":"* /2020 = Cumul janv 2021-oct 2021 / Cumul janv 2020-oct 2020          * /2019 = Cumul janv 2021-oct 2021 / Cumul janv 2019-oct 2019"}]
["Sont repris ici l'ensemble des indices entrant dans la composition de tous les index TP"]
[{"$f":"\"Les indices composants l'index TP choisi dans la liste déroulante de la dernière colonne sont marqués d'une croix\"","v":"Les indices composants l'index TP choisi dans la liste déroulante de la dernière colonne sont marqués d'une croix"}]
[]
[null,"/ 2020*","/ 2019*","TP02"]
[{"$f":"HYPERLINK('Indices depuis janvier'!K5,'Indices depuis janvier'!J5)","v":"Tôles quarto et autres produits plats en aciers non alliés de qualité"},{"$f":"'Indices depuis janvier'!L5","v":0.58393051031487486},{"$f":"'Indices depuis janvier'!M5","v":0.44564463383212782},{"$f":"'Indices depuis janvier'!N5","v":""}]
[{"$f":"HYPERLINK('Indices depuis janvier'!K6,'Indices depuis janvier'!J6)","v":"Barres crénelées ou nervurées pour béton armé"},{"$f":"'Indices depuis janvier'!L6","v":0.49380706988518241},{"$f":"'Indices depuis janvier'!M6","v":0.36126215191959177},{"$f":"'Indices depuis janvier'!N6","v":"x"}]
[{"$f":"HYPERLINK('Indices depuis janvier'!K7,'Indices depuis janvier'!J7)","v":"Acier pour la construction"},{"$f":"'Indices depuis janvier'!L7","v":0.47459340255444271},{"$f":"'Indices depuis janvier'!M7","v":0.34676065793890554},{"$f":"'Indices depuis janvier'!N7","v":""}]
[{"$f":"HYPERLINK('Indices depuis janvier'!K8,'Indices depuis janvier'!J8)","v":"Matières plastiques sous formes primaires"},{"$f":"'Indices depuis janvier'!L8","v":0.41793830277747301},{"$f":"'Indices depuis janvier'!M8","v":0.24695887236918335},{"$f":"'Indices depuis janvier'!N8","v":""}]
[{"$f":"HYPERLINK('Indices depuis janvier'!K9,'Indices depuis janvier'!J9)","v":"Gazole routier HTT"},{"$f":"'Indices depuis janvier'!L9","v":0.35283028274210348},{"$f":"'Indices depuis janvier'!M9","v":-0.15005089240728497},{"$f":"'Indices depuis janvier'!N9","v":""}]
[{"$f":"HYPERLINK('Indices depuis janvier'!K10,'Indices depuis janvier'!J10)","v":"Fioul lourd"},{"$f":"'Indices depuis janvier'!L10","v":0.34776709988821985},{"$f":"'Indices depuis janvier'!M10","v":-0.15323196234867797},{"$f":"'Indices depuis janvier'!N10","v":""}]
[{"$f":"HYPERLINK('Indices depuis janvier'!K11,'Indices depuis janvier'!J11)","v":"Produits sidérurgiques en acier non allié"},{"$f":"'Indices depuis janvier'!L11","v":0.26905999055266894},{"$f":"'Indices depuis janvier'!M11","v":0.18081926863572417},{"$f":"'Indices depuis janvier'!N11","v":""}]
[{"$f":"HYPERLINK('Indices depuis janvier'!K12,'Indices depuis janvier'!J12)","v":"Collecte, traitement et élimination des déchets ; récupération de matériaux"},{"$f":"'Indices depuis janvier'!L12","v":0.19095931692616785},{"$f":"'Indices depuis janvier'!M12","v":0.16406480117820332},{"$f":"'Indices depuis janvier'!N12","v":""}]
[{"$f":"HYPERLINK('Indices depuis janvier'!K13,'Indices depuis janvier'!J13)","v":"Fils et câbles d'énergie"},{"$f":"'Indices depuis janvier'!L13","v":0.18786096818229558},{"$f":"'Indices depuis janvier'!M13","v":0.17735220649458738},{"$f":"'Indices depuis janvier'!N13","v":""}]
[{"$f":"HYPERLINK('Indices depuis janvier'!K14,'Indices depuis janvier'!J14)","v":"Ensemble des produits du sciage"},{"$f":"'Indices depuis janvier'!L14","v":0.17970283151107402},{"$f":"'Indices depuis janvier'!M14","v":0.15890939135224502},{"$f":"'Indices depuis janvier'!N14","v":"x"}]
[{"$f":"HYPERLINK('Indices depuis janvier'!K15,'Indices depuis janvier'!J15)","v":"Bitume"},{"$f":"'Indices depuis janvier'!L15","v":0.1784524250277677},{"$f":"'Indices depuis janvier'!M15","v":6.0575769692123194E-2},{"$f":"'Indices depuis janvier'!N15","v":""}]
[{"$f":"HYPERLINK('Indices depuis janvier'!K16,'Indices depuis janvier'!J16)","v":"GNR"},{"$f":"'Indices depuis janvier'!L16","v":0.16641664166416636},{"$f":"'Indices depuis janvier'!M16","v":-4.6673205819846464E-2},{"$f":"'Indices depuis janvier'!N16","v":""}]
[{"$f":"HYPERLINK('Indices depuis janvier'!K17,'Indices depuis janvier'!J17)","v":"Plaques, feuilles, tubes et profilés en matières plastiques"},{"$f":"'Indices depuis janvier'!L17","v":0.16080349708576192},{"$f":"'Indices depuis janvier'!M17","v":0.11074594163927909},{"$f":"'Indices depuis janvier'!N17","v":""}]
[{"$f":"HYPERLINK('Indices depuis janvier'!K18,'Indices depuis janvier'!J18)","v":"Tubes, tuyaux en matière plastique"},{"$f":"'Indices depuis janvier'!L18","v":0.12234255916566394},{"$f":"'Indices depuis janvier'!M18","v":0.11908809119088093},{"$f":"'Indices depuis janvier'!N18","v":"x"}]
[{"$f":"HYPERLINK('Indices depuis janvier'!K19,'Indices depuis janvier'!J19)","v":"Gazole"},{"$f":"'Indices depuis janvier'!L19","v":0.10335912591469243},{"$f":"'Indices depuis janvier'!M19","v":-3.0775527236542199E-2},{"$f":"'Indices depuis janvier'!N19","v":""}]
[{"$f":"HYPERLINK('Indices depuis janvier'!K20,'Indices depuis janvier'!J20)","v":"Tubes, tuyaux, profilés creux et accessoires correspondants en acier"},{"$f":"'Indices depuis janvier'!L20","v":8.0596164799696002E-2},{"$f":"'Indices depuis janvier'!M20","v":5.9573675881969601E-2},{"$f":"'Indices depuis janvier'!N20","v":""}]
[{"$f":"HYPERLINK('Indices depuis janvier'!K21,'Indices depuis janvier'!J21)","v":"Éléments en métal pour la construction"},{"$f":"'Indices depuis janvier'!L21","v":5.8182151365218981E-2},{"$f":"'Indices depuis janvier'!M21","v":8.6964705882353055E-2},{"$f":"'Indices depuis janvier'!N21","v":""}]
[{"$f":"HYPERLINK('Indices depuis janvier'!K22,'Indices depuis janvier'!J22)","v":"Tuyaux d'assainissement"},{"$f":"'Indices depuis janvier'!L22","v":5.6208135132511217E-2},{"$f":"'Indices depuis janvier'!M22","v":3.4417189579767804E-2},{"$f":"'Indices depuis janvier'!N22","v":""}]
[{"$f":"HYPERLINK('Indices depuis janvier'!K23,'Indices depuis janvier'!J23)","v":"Travaux de fonderie de fonte"},{"$f":"'Indices depuis janvier'!L23","v":5.305124388688065E-2},{"$f":"'Indices depuis janvier'!M23","v":4.4941449519991572E-2},{"$f":"'Indices depuis janvier'!N23","v":""}]
[{"$f":"HYPERLINK('Indices depuis janvier'!K24,'Indices depuis janvier'!J24)","v":"Traitement et élimination des déchets non dangereux"},{"$f":"'Indices depuis janvier'!L24","v":5.1931828321584605E-2},{"$f":"'Indices depuis janvier'!M24","v":8.5043718361711651E-2},{"$f":"'Indices depuis janvier'!N24","v":""}]
[{"$f":"HYPERLINK('Indices depuis janvier'!K25,'Indices depuis janvier'!J25)","v":"Produits de voierie en béton"},{"$f":"'Indices depuis janvier'!L25","v":4.0738261451659152E-2},{"$f":"'Indices depuis janvier'!M25","v":7.7738165973459949E-2},{"$f":"'Indices depuis janvier'!N25","v":""}]
[{"$f":"HYPERLINK('Indices depuis janvier'!K26,'Indices depuis janvier'!J26)","v":"Électricité vendue aux entreprises consommatrices finales"},{"$f":"'Indices depuis janvier'!L26","v":3.987677562895775E-2},{"$f":"'Indices depuis janvier'!M26","v":8.3452211126961551E-2},{"$f":"'Indices depuis janvier'!N26","v":"x"}]
[{"$f":"HYPERLINK('Indices depuis janvier'!K27,'Indices depuis janvier'!J27)","v":"Matériel"},{"$f":"'Indices depuis janvier'!L27","v":2.9439969313387104E-2},{"$f":"'Indices depuis janvier'!M27","v":2.0728344584957537E-2},{"$f":"'Indices depuis janvier'!N27","v":"x"}]
[{"$f":"HYPERLINK('Indices depuis janvier'!K28,'Indices depuis janvier'!J28)","v":"Peintures Industries"},{"$f":"'Indices depuis janvier'!L28","v":2.487831260140605E-2},{"$f":"'Indices depuis janvier'!M28","v":5.3460576299453111E-2},{"$f":"'Indices depuis janvier'!N28","v":""}]
[{"$f":"HYPERLINK('Indices depuis janvier'!K29,'Indices depuis janvier'!J29)","v":"Matériel de distribution et de commande électrique"},{"$f":"'Indices depuis janvier'!L29","v":2.485733629944864E-2},{"$f":"'Indices depuis janvier'!M29","v":4.5176563424738525E-2},{"$f":"'Indices depuis janvier'!N29","v":""}]
[{"$f":"HYPERLINK('Indices depuis janvier'!K30,'Indices depuis janvier'!J30)","v":"Ciment, chaux et plâtre"},{"$f":"'Indices depuis janvier'!L30","v":2.3323899677954341E-2},{"$f":"'Indices depuis janvier'!M30","v":2.4824081313526092E-2},{"$f":"'Indices depuis janvier'!N30","v":""}]
[{"$f":"HYPERLINK('Indices depuis janvier'!K31,'Indices depuis janvier'!J31)","v":"Moteurs, génératrices, transfo. électr., matér. distrib., cmde électr."},{"$f":"'Indices depuis janvier'!L31","v":1.6018527453440345E-2},{"$f":"'Indices depuis janvier'!M31","v":2.6418405147202284E-2},{"$f":"'Indices depuis janvier'!N31","v":""}]
[{"$f":"HYPERLINK('Indices depuis janvier'!K32,'Indices depuis janvier'!J32)","v":"Éléments en béton pour la construction"},{"$f":"'Indices depuis janvier'!L32","v":1.5975987606506425E-2},{"$f":"'Indices depuis janvier'!M32","v":4.2005958291956302E-2},{"$f":"'Indices depuis janvier'!N32","v":""}]
[{"$f":"HYPERLINK('Indices depuis janvier'!K33,'Indices depuis janvier'!J33)","v":"Travail activités spécialisées"},{"$f":"'Indices depuis janvier'!L33","v":1.5477072528196301E-2},{"$f":"'Indices depuis janvier'!M33","v":3.3082077051926229E-2},{"$f":"'Indices depuis janvier'!N33","v":""}]
[{"$f":"HYPERLINK('Indices depuis janvier'!K34,'Indices depuis janvier'!J34)","v":"Béton prêt à l'emploi"},{"$f":"'Indices depuis janvier'!L34","v":1.383191834398545E-2},{"$f":"'Indices depuis janvier'!M34","v":1.3541865344268489E-2},{"$f":"'Indices depuis janvier'!N34","v":"x"}]
[{"$f":"HYPERLINK('Indices depuis janvier'!K35,'Indices depuis janvier'!J35)","v":"Frais divers"},{"$f":"'Indices depuis janvier'!L35","v":1.2368344767610395E-2},{"$f":"'Indices depuis janvier'!M35","v":1.3347519102427929E-2},{"$f":"'Indices depuis janvier'!N35","v":"x"}]
[{"$f":"HYPERLINK('Indices depuis janvier'!K36,'Indices depuis janvier'!J36)","v":"Sables et granulats"},{"$f":"'Indices depuis janvier'!L36","v":1.1743012422360088E-2},{"$f":"'Indices depuis janvier'!M36","v":2.8410772417875041E-2},{"$f":"'Indices depuis janvier'!N36","v":""}]
[{"$f":"HYPERLINK('Indices depuis janvier'!K37,'Indices depuis janvier'!J37)","v":"Mortiers et bétons secs"},{"$f":"'Indices depuis janvier'!L37","v":9.9285146942018621E-3},{"$f":"'Indices depuis janvier'!M37","v":2.0363125689638162E-2},{"$f":"'Indices depuis janvier'!N37","v":""}]
[{"$f":"HYPERLINK('Indices depuis janvier'!K38,'Indices depuis janvier'!J38)","v":"Tuiles, briques et produits de construction en terre cuite"},{"$f":"'Indices depuis janvier'!L38","v":9.2000774743365987E-3},{"$f":"'Indices depuis janvier'!M38","v":2.6193993106844005E-2},{"$f":"'Indices depuis janvier'!N38","v":""}]
[{"$f":"HYPERLINK('Indices depuis janvier'!K39,'Indices depuis janvier'!J39)","v":"Restaurants et hôtels"},{"$f":"'Indices depuis janvier'!L39","v":5.7159214730271302E-3},{"$f":"'Indices depuis janvier'!M39","v":1.5733124428776613E-2},{"$f":"'Indices depuis janvier'!N39","v":""}]
[{"$f":"HYPERLINK('Indices depuis janvier'!K40,'Indices depuis janvier'!J40)","v":"Transports routiers"},{"$f":"'Indices depuis janvier'!L40","v":3.2867707477404196E-3},{"$f":"'Indices depuis janvier'!M40","v":4.5708017186214533E-3},{"$f":"'Indices depuis janvier'!N40","v":"x"}]
[{"$f":"HYPERLINK('Indices depuis janvier'!K41,'Indices depuis janvier'!J41)","v":"Produits explosifs"},{"$f":"'Indices depuis janvier'!L41","v":-1.6333589546503324E-3},{"$f":"'Indices depuis janvier'!M41","v":6.6847510172445279E-3},{"$f":"'Indices depuis janvier'!N41","v":""}]
[{"$f":"HYPERLINK('Indices depuis janvier'!K42,'Indices depuis janvier'!J42)","v":"Appareils d'éclairage électrique"},{"$f":"'Indices depuis janvier'!L42","v":-3.5934291581107836E-3},{"$f":"'Indices depuis janvier'!M42","v":-2.0290732889157947E-2},{"$f":"'Indices depuis janvier'!N42","v":""}]
[{"$f":"HYPERLINK('Indices depuis janvier'!K43,'Indices depuis janvier'!J43)","v":"Autres textiles n.c.a."},{"$f":"'Indices depuis janvier'!L43","v":-4.3298019345924255E-3},{"$f":"'Indices depuis janvier'!M43","v":1.0188015189402932E-3},{"$f":"'Indices depuis janvier'!N43","v":""}]
[{"$f":"HYPERLINK('Indices depuis janvier'!K44,'Indices depuis janvier'!J44)","v":"Travail"},{"$f":"'Indices depuis janvier'!L44","v":-6.3081277800242086E-3},{"$f":"'Indices depuis janvier'!M44","v":3.4299714169048201E-3},{"$f":"'Indices depuis janvier'!N44","v":"x"}]
[{"$f":"HYPERLINK('Indices depuis janvier'!K45,'Indices depuis janvier'!J45)","v":"Câbles de fibres optiques"},{"$f":"'Indices depuis janvier'!L45","v":-2.823639774859299E-2},{"$f":"'Indices depuis janvier'!M45","v":-4.1188448722695337E-2},{"$f":"'Indices depuis janvier'!N45","v":""}]
[{"$f":"'Indice prix'!$B$77&\" \"&'Indice prix'!$B$78","v":"Pour les indices suivants, les valeurs d'octobre 2021 sont considérées comme équivalentes à celles de septembre 2021 : Travail, Travail activités spécialisées, Fils et câbles d'énergie, Tuyaux d'assainissement"}]

{"sheet":"Evol indices 3-6 mois glissants","index":18,"n_rows":49,"n_cols":4,"rows_kept":49,"cut":false,"hidden":false,"merged":[[48,0,49,3],[50,0,51,3]]}
["CLASSEMENT DES INDICES SELON LEUR ÉVOLUTION SUR 3 MOIS GLISSANTS"]
[]
[{"$f":"'Index 3-6 mois glissants'!H1&\"          \"&'Index 3-6 mois glissants'!H2","v":"* 3 mois = août 2021-oct 2021 / mai 2021-juil 2021          * 6 mois = mai 2021-oct 2021 / nov 2020-avr 2021"}]
["Sont repris ici l'ensemble des indices entrant dans la composition de tous les index TP"]
[{"$f":"\"Les indices composants l'index TP choisi dans la liste déroulante de la dernière colonne sont marqués d'une croix\"","v":"Les indices composants l'index TP choisi dans la liste déroulante de la dernière colonne sont marqués d'une croix"}]
[]
[null,"3 mois*","6 mois*","TP02"]
[{"$f":"HYPERLINK('Indices 3-6 mois glissants'!K5,'Indices 3-6 mois glissants'!J5)","v":"Tôles quarto et autres produits plats en aciers non alliés de qualité"},{"$f":"'Indices 3-6 mois glissants'!L5","v":0.19175349146530674},{"$f":"'Indices 3-6 mois glissants'!M5","v":0.4941816533172132},{"$f":"'Indices 3-6 mois glissants'!N5","v":""}]
[{"$f":"HYPERLINK('Indices 3-6 mois glissants'!K6,'Indices 3-6 mois glissants'!J6)","v":"Acier pour la construction"},{"$f":"'Indices 3-6 mois glissants'!L6","v":0.17116564417177926},{"$f":"'Indices 3-6 mois glissants'!M6","v":0.39184583114840055},{"$f":"'Indices 3-6 mois glissants'!N6","v":""}]
[{"$f":"HYPERLINK('Indices 3-6 mois glissants'!K7,'Indices 3-6 mois glissants'!J7)","v":"Barres crénelées ou nervurées pour béton armé"},{"$f":"'Indices 3-6 mois glissants'!L7","v":0.14697178930755572},{"$f":"'Indices 3-6 mois glissants'!M7","v":0.37290273747950042},{"$f":"'Indices 3-6 mois glissants'!N7","v":"x"}]
[{"$f":"HYPERLINK('Indices 3-6 mois glissants'!K8,'Indices 3-6 mois glissants'!J8)","v":"Bitume"},{"$f":"'Indices 3-6 mois glissants'!L8","v":9.8974680895584921E-2},{"$f":"'Indices 3-6 mois glissants'!M8","v":0.18963472485768484},{"$f":"'Indices 3-6 mois glissants'!N8","v":""}]
[{"$f":"HYPERLINK('Indices 3-6 mois glissants'!K9,'Indices 3-6 mois glissants'!J9)","v":"Produits sidérurgiques en acier non allié"},{"$f":"'Indices 3-6 mois glissants'!L9","v":9.6252755326965422E-2},{"$f":"'Indices 3-6 mois glissants'!M9","v":0.22149279292136415},{"$f":"'Indices 3-6 mois glissants'!N9","v":""}]
[{"$f":"HYPERLINK('Indices 3-6 mois glissants'!K10,'Indices 3-6 mois glissants'!J10)","v":"Gazole routier HTT"},{"$f":"'Indices 3-6 mois glissants'!L10","v":8.987882897169519E-2},{"$f":"'Indices 3-6 mois glissants'!M10","v":0.15588366430369271},{"$f":"'Indices 3-6 mois glissants'!N10","v":""}]
[{"$f":"HYPERLINK('Indices 3-6 mois glissants'!K11,'Indices 3-6 mois glissants'!J11)","v":"GNR"},{"$f":"'Indices 3-6 mois glissants'!L11","v":7.9509831860929081E-2},{"$f":"'Indices 3-6 mois glissants'!M11","v":0.1502206809583857},{"$f":"'Indices 3-6 mois glissants'!N11","v":""}]
[{"$f":"HYPERLINK('Indices 3-6 mois glissants'!K12,'Indices 3-6 mois glissants'!J12)","v":"Tubes, tuyaux en matière plastique"},{"$f":"'Indices 3-6 mois glissants'!L12","v":7.8334304018637058E-2},{"$f":"'Indices 3-6 mois glissants'!M12","v":0.18397478433974768},{"$f":"'Indices 3-6 mois glissants'!N12","v":"x"}]
[{"$f":"HYPERLINK('Indices 3-6 mois glissants'!K13,'Indices 3-6 mois glissants'!J13)","v":"Fioul lourd"},{"$f":"'Indices 3-6 mois glissants'!L13","v":7.7335218075283318E-2},{"$f":"'Indices 3-6 mois glissants'!M13","v":0.14894596307166563},{"$f":"'Indices 3-6 mois glissants'!N13","v":""}]
[{"$f":"HYPERLINK('Indices 3-6 mois glissants'!K14,'Indices 3-6 mois glissants'!J14)","v":"Ensemble des produits du sciage"},{"$f":"'Indices 3-6 mois glissants'!L14","v":7.1614583333333259E-2},{"$f":"'Indices 3-6 mois glissants'!M14","v":0.16199240432369266},{"$f":"'Indices 3-6 mois glissants'!N14","v":"x"}]
[{"$f":"HYPERLINK('Indices 3-6 mois glissants'!K15,'Indices 3-6 mois glissants'!J15)","v":"Fils et câbles d'énergie"},{"$f":"'Indices 3-6 mois glissants'!L15","v":6.4367816091953856E-2},{"$f":"'Indices 3-6 mois glissants'!M15","v":0.18411076314488195},{"$f":"'Indices 3-6 mois glissants'!N15","v":""}]
[{"$f":"HYPERLINK('Indices 3-6 mois glissants'!K16,'Indices 3-6 mois glissants'!J16)","v":"Peintures Industries"},{"$f":"'Indices 3-6 mois glissants'!L16","v":6.4068497195157947E-2},{"$f":"'Indices 3-6 mois glissants'!M16","v":5.9402939839369617E-2},{"$f":"'Indices 3-6 mois glissants'!N16","v":""}]
[{"$f":"HYPERLINK('Indices 3-6 mois glissants'!K17,'Indices 3-6 mois glissants'!J17)","v":"Éléments en métal pour la construction"},{"$f":"'Indices 3-6 mois glissants'!L17","v":4.878752886836013E-2},{"$f":"'Indices 3-6 mois glissants'!M17","v":6.7860367138128153E-2},{"$f":"'Indices 3-6 mois glissants'!N17","v":""}]
[{"$f":"HYPERLINK('Indices 3-6 mois glissants'!K18,'Indices 3-6 mois glissants'!J18)","v":"Plaques, feuilles, tubes et profilés en matières plastiques"},{"$f":"'Indices 3-6 mois glissants'!L18","v":4.5794930875576068E-2},{"$f":"'Indices 3-6 mois glissants'!M18","v":0.19237871411784435},{"$f":"'Indices 3-6 mois glissants'!N18","v":""}]
[{"$f":"HYPERLINK('Indices 3-6 mois glissants'!K19,'Indices 3-6 mois glissants'!J19)","v":"Gazole"},{"$f":"'Indices 3-6 mois glissants'!L19","v":4.2386142147308403E-2},{"$f":"'Indices 3-6 mois glissants'!M19","v":9.8709277254334316E-2},{"$f":"'Indices 3-6 mois glissants'!N19","v":""}]
[{"$f":"HYPERLINK('Indices 3-6 mois glissants'!K20,'Indices 3-6 mois glissants'!J20)","v":"Travaux de fonderie de fonte"},{"$f":"'Indices 3-6 mois glissants'!L20","v":4.1233657391887446E-2},{"$f":"'Indices 3-6 mois glissants'!M20","v":7.0311126735805862E-2},{"$f":"'Indices 3-6 mois glissants'!N20","v":""}]
[{"$f":"HYPERLINK('Indices 3-6 mois glissants'!K21,'Indices 3-6 mois glissants'!J21)","v":"Tubes, tuyaux, profilés creux et accessoires correspondants en acier"},{"$f":"'Indices 3-6 mois glissants'!L21","v":2.8288130650335308E-2},{"$f":"'Indices 3-6 mois glissants'!M21","v":5.8277541083384232E-2},{"$f":"'Indices 3-6 mois glissants'!N21","v":""}]
[{"$f":"HYPERLINK('Indices 3-6 mois glissants'!K22,'Indices 3-6 mois glissants'!J22)","v":"Ciment, chaux et plâtre"},{"$f":"'Indices 3-6 mois glissants'!L22","v":2.0231213872832443E-2},{"$f":"'Indices 3-6 mois glissants'!M22","v":5.7553956834532904E-3},{"$f":"'Indices 3-6 mois glissants'!N22","v":""}]
[{"$f":"HYPERLINK('Indices 3-6 mois glissants'!K23,'Indices 3-6 mois glissants'!J23)","v":"Restaurants et hôtels"},{"$f":"'Indices 3-6 mois glissants'!L23","v":2.0182530932255416E-2},{"$f":"'Indices 3-6 mois glissants'!M23","v":2.5799328191092208E-2},{"$f":"'Indices 3-6 mois glissants'!N23","v":""}]
[{"$f":"HYPERLINK('Indices 3-6 mois glissants'!K24,'Indices 3-6 mois glissants'!J24)","v":"Produits de voierie en béton"},{"$f":"'Indices 3-6 mois glissants'!L24","v":2.0036991368680646E-2},{"$f":"'Indices 3-6 mois glissants'!M24","v":1.8337218337218353E-2},{"$f":"'Indices 3-6 mois glissants'!N24","v":""}]
[{"$f":"HYPERLINK('Indices 3-6 mois glissants'!K25,'Indices 3-6 mois glissants'!J25)","v":"Tuyaux d'assainissement"},{"$f":"'Indices 3-6 mois glissants'!L25","v":1.4519056261342866E-2},{"$f":"'Indices 3-6 mois glissants'!M25","v":6.2031573911656812E-2},{"$f":"'Indices 3-6 mois glissants'!N25","v":""}]
[{"$f":"HYPERLINK('Indices 3-6 mois glissants'!K26,'Indices 3-6 mois glissants'!J26)","v":"Moteurs, génératrices, transfo. électr., matér. distrib., cmde électr."},{"$f":"'Indices 3-6 mois glissants'!L26","v":1.4294790343075015E-2},{"$f":"'Indices 3-6 mois glissants'!M26","v":1.2615777706803E-2},{"$f":"'Indices 3-6 mois glissants'!N26","v":""}]
[{"$f":"HYPERLINK('Indices 3-6 mois glissants'!K27,'Indices 3-6 mois glissants'!J27)","v":"Matériel de distribution et de commande électrique"},{"$f":"'Indices 3-6 mois glissants'!L27","v":1.2614317250078777E-2},{"$f":"'Indices 3-6 mois glissants'!M27","v":1.4303877940241572E-2},{"$f":"'Indices 3-6 mois glissants'!N27","v":""}]
[{"$f":"HYPERLINK('Indices 3-6 mois glissants'!K28,'Indices 3-6 mois glissants'!J28)","v":"Mortiers et bétons secs"},{"$f":"'Indices 3-6 mois glissants'!L28","v":1.051939513477973E-2},{"$f":"'Indices 3-6 mois glissants'!M28","v":1.6622340425531901E-2},{"$f":"'Indices 3-6 mois glissants'!N28","v":""}]
[{"$f":"HYPERLINK('Indices 3-6 mois glissants'!K29,'Indices 3-6 mois glissants'!J29)","v":"Matériel"},{"$f":"'Indices 3-6 mois glissants'!L29","v":7.7327559542221813E-3},{"$f":"'Indices 3-6 mois glissants'!M29","v":2.5110549589387299E-2},{"$f":"'Indices 3-6 mois glissants'!N29","v":"x"}]
[{"$f":"HYPERLINK('Indices 3-6 mois glissants'!K30,'Indices 3-6 mois glissants'!J30)","v":"Tuiles, briques et produits de construction en terre cuite"},{"$f":"'Indices 3-6 mois glissants'!L30","v":7.6433121019108263E-3},{"$f":"'Indices 3-6 mois glissants'!M30","v":2.2049286640726473E-2},{"$f":"'Indices 3-6 mois glissants'!N30","v":""}]
[{"$f":"HYPERLINK('Indices 3-6 mois glissants'!K31,'Indices 3-6 mois glissants'!J31)","v":"Éléments en béton pour la construction"},{"$f":"'Indices 3-6 mois glissants'!L31","v":7.6238881829733263E-3},{"$f":"'Indices 3-6 mois glissants'!M31","v":1.5097976228718224E-2},{"$f":"'Indices 3-6 mois glissants'!N31","v":""}]
[{"$f":"HYPERLINK('Indices 3-6 mois glissants'!K32,'Indices 3-6 mois glissants'!J32)","v":"Autres textiles n.c.a."},{"$f":"'Indices 3-6 mois glissants'!L32","v":6.7922198209322548E-3},{"$f":"'Indices 3-6 mois glissants'!M32","v":3.0864197530864335E-3},{"$f":"'Indices 3-6 mois glissants'!N32","v":""}]
[{"$f":"HYPERLINK('Indices 3-6 mois glissants'!K33,'Indices 3-6 mois glissants'!J33)","v":"Frais divers"},{"$f":"'Indices 3-6 mois glissants'!L33","v":6.0126582278481333E-3},{"$f":"'Indices 3-6 mois glissants'!M33","v":2.2254475084663605E-2},{"$f":"'Indices 3-6 mois glissants'!N33","v":"x"}]
[{"$f":"HYPERLINK('Indices 3-6 mois glissants'!K34,'Indices 3-6 mois glissants'!J34)","v":"Béton prêt à l'emploi"},{"$f":"'Indices 3-6 mois glissants'!L34","v":5.969211435752575E-3},{"$f":"'Indices 3-6 mois glissants'!M34","v":6.4627994955861467E-3},{"$f":"'Indices 3-6 mois glissants'!N34","v":"x"}]
[{"$f":"HYPERLINK('Indices 3-6 mois glissants'!K35,'Indices 3-6 mois glissants'!J35)","v":"Transports routiers"},{"$f":"'Indices 3-6 mois glissants'!L35","v":2.721499848805653E-3},{"$f":"'Indices 3-6 mois glissants'!M35","v":1.2381534698868712E-2},{"$f":"'Indices 3-6 mois glissants'!N35","v":"x"}]
[{"$f":"HYPERLINK('Indices 3-6 mois glissants'!K36,'Indices 3-6 mois glissants'!J36)","v":"Traitement et élimination des déchets non dangereux"},{"$f":"'Indices 3-6 mois glissants'!L36","v":1.9768426998023614E-3},{"$f":"'Indices 3-6 mois glissants'!M36","v":2.5756041093908388E-2},{"$f":"'Indices 3-6 mois glissants'!N36","v":""}]
[{"$f":"HYPERLINK('Indices 3-6 mois glissants'!K37,'Indices 3-6 mois glissants'!J37)","v":"Sables et granulats"},{"$f":"'Indices 3-6 mois glissants'!L37","v":1.9212295869357465E-3},{"$f":"'Indices 3-6 mois glissants'!M37","v":5.3063193439459866E-3},{"$f":"'Indices 3-6 mois glissants'!N37","v":""}]
[{"$f":"HYPERLINK('Indices 3-6 mois glissants'!K38,'Indices 3-6 mois glissants'!J38)","v":"Travail"},{"$f":"'Indices 3-6 mois glissants'!L38","v":8.1588251291808689E-4},{"$f":"'Indices 3-6 mois glissants'!M38","v":-5.6764427625354275E-3},{"$f":"'Indices 3-6 mois glissants'!N38","v":"x"}]
[{"$f":"HYPERLINK('Indices 3-6 mois glissants'!K39,'Indices 3-6 mois glissants'!J39)","v":"Produits explosifs"},{"$f":"'Indices 3-6 mois glissants'!L39","v":6.3877355477481856E-4},{"$f":"'Indices 3-6 mois glissants'!M39","v":7.8841512469831621E-3},{"$f":"'Indices 3-6 mois glissants'!N39","v":""}]
[{"$f":"HYPERLINK('Indices 3-6 mois glissants'!K40,'Indices 3-6 mois glissants'!J40)","v":"Travail activités spécialisées"},{"$f":"'Indices 3-6 mois glissants'!L40","v":-2.7070925825667391E-4},{"$f":"'Indices 3-6 mois glissants'!M40","v":-3.6417588346372431E-3},{"$f":"'Indices 3-6 mois glissants'!N40","v":""}]
[{"$f":"HYPERLINK('Indices 3-6 mois glissants'!K41,'Indices 3-6 mois glissants'!J41)","v":"Câbles de fibres optiques"},{"$f":"'Indices 3-6 mois glissants'!L41","v":-9.752925877763996E-4},{"$f":"'Indices 3-6 mois glissants'!M41","v":-2.7979766044893939E-2},{"$f":"'Indices 3-6 mois glissants'!N41","v":""}]
[{"$f":"HYPERLINK('Indices 3-6 mois glissants'!K42,'Indices 3-6 mois glissants'!J42)","v":"Matières plastiques sous formes primaires"},{"$f":"'Indices 3-6 mois glissants'!L42","v":-1.6895969104513409E-3},{"$f":"'Indices 3-6 mois glissants'!M42","v":0.26532171786642222},{"$f":"'Indices 3-6 mois glissants'!N42","v":""}]
[{"$f":"HYPERLINK('Indices 3-6 mois glissants'!K43,'Indices 3-6 mois glissants'!J43)","v":"Collecte, traitement et élimination des déchets ; récupération de matériaux"},{"$f":"'Indices 3-6 mois glissants'!L43","v":-5.7581573896352545E-3},{"$f":"'Indices 3-6 mois glissants'!M43","v":9.9803417510963E-2},{"$f":"'Indices 3-6 mois glissants'!N43","v":""}]
[{"$f":"HYPERLINK('Indices 3-6 mois glissants'!K44,'Indices 3-6 mois glissants'!J44)","v":"Appareils d'éclairage électrique"},{"$f":"'Indices 3-6 mois glissants'!L44","v":-9.6054888507719483E-3},{"$f":"'Indices 3-6 mois glissants'!M44","v":-1.2425531914893595E-2},{"$f":"'Indices 3-6 mois glissants'!N44","v":""}]
[{"$f":"HYPERLINK('Indices 3-6 mois glissants'!K45,'Indices 3-6 mois glissants'!J45)","v":"Électricité vendue aux entreprises consommatrices finales"},{"$f":"'Indices 3-6 mois glissants'!L45","v":-2.1034180543383019E-2},{"$f":"'Indices 3-6 mois glissants'!M45","v":-0.13398107900792633},{"$f":"'Indices 3-6 mois glissants'!N45","v":"x"}]
[{"$f":"'Indice prix'!$B$77&\" \"&'Indice prix'!$B$78","v":"Pour les indices suivants, les valeurs d'octobre 2021 sont considérées comme équivalentes à celles de septembre 2021 : Travail, Travail activités spécialisées, Fils et câbles d'énergie, Tuyaux d'assainissement"}]

{"sheet":"Notice d'utilisation Outil","index":19,"n_rows":36,"n_cols":2,"rows_kept":36,"cut":false,"hidden":true,"merged":[[1,1,1,2],[4,0,6,3],[7,0,8,3],[35,0,37,1],[20,0,21,1],[22,0,23,1],[14,0,14,3],[16,0,17,1],[26,0,29,1],[30,0,34,1],[9,0,10,3]]}
[]
[null,"NOTICE D'UTILISATION DE L'OUTIL INDEX - INDICES DATE À DATE"]
[]
[]
["Dans un contexte de forte volatilité du prix des matières premières, la FNTP met à disposition des FRTP et des Syndicats de spécialités cet outil pour objectiver les évolutions des index TP et des indices entrant dans leur composition. Il permet d'avoir une vision claire, simple et partagée des évolutions sur une période souhaitée et sera régulièrement actualisé."]
[]
[]
[{"$f":"\"Point de vigilance : la publication des index et indices est en décalage de 2 à 3 mois - cette édition porte sur les données à fin \"&LOWER('Données à modifier'!A1)","v":"Point de vigilance : la publication des index et indices est en décalage de 2 à 3 mois - cette édition porte sur les données à fin octobre"}]
[]
["Ce document est un outil d'aide à destination des entreprises de Travaux Publics établi sur la base des données de l'Insee. Il s'agit d'informations communiquées à titre informatif."]
[]
[]
["Cet outil est composé d'un onglet permettant d'observer l'évolution de l'index souhaité entre deux dates souhaitées."]
[]
["Résultats date à date"]
[]
["Pour sélectionner l'index qui vous intéresse, il suffit de le selectionner dans la liste déroulante en haut de la page."]
[]
[]
[]
["Pour sélectionner les dates qui vous intéresse, il suffit de les inscrire en haut à droite de la page."]
[]
[{"$f":"\"La première date inscrite doit être antérieure à la seconde et les dates doivent être comprises entre le 01/01/2018 et le \"&TEXT(date,\"jj/mm/aaaa\")&\".\"","v":"La première date inscrite doit être antérieure à la seconde et les dates doivent être comprises entre le 01/01/2018 et le 01/10/2021."}]
[]
[]
[]
["La partie haute présente l'évolution de l'index TP sélectionné dans la liste déroulante en comparaison de l'index TP01 sur la période désirée. Le graphique de droite présente la composition globale de l'index sélectionné."]
[]
[]
[]
["La partie centrale présente l'évolution des indices communs à la plupart des index TP sur la période désirée, en détaillant la part respective de ces indices dans l'index TP sélectionné. Les évolutions des trois postes principaux (Matériel, Travail et GNR) sont représentées sous forme de courbes."]
[]
[]
[]
[]
["La dernière partie présente l'évolution des indices spécifiques à l'index TP sélectionné sur la période désirée. Les évolutions des deux postes principaux sont représentées sous forme de courbes."]

{"sheet":"Résultats date à date","index":20,"n_rows":40,"n_cols":13,"rows_kept":40,"cut":false,"hidden":true,"merged":[[37,6,37,7],[38,6,38,7],[39,6,39,7],[18,4,18,7],[31,6,31,7],[32,6,32,7],[33,6,33,7],[34,6,34,7],[35,6,35,7],[36,6,36,7],[24,1,24,2],[25,1,25,2],[30,6,30,7],[0,1,0,12],[5,10,5,13],[11,6,11,8],[30,0,30,5],[19,1,19,2],[20,1,20,2],[21,1,21,2],[22,1,22,2],[23,1,23,2],[2,11,3,11],[2,3,2,9]]}
[null,"EVOLUTION DES INDEX ET INDICES TP SELON LA PÉRIODE DÉSIRÉE"]
[]
["Index souhaité","TP02",null,{"$f":"B3&\" - \"&VLOOKUP(B3,'Noms index'!$A$1:$B$23,2,FALSE)","v":"TP02 - Travaux de génie civil et d’ouvrages d’art neufs ou rénovation"},null,null,null,null,null,null,null,"Période souhaitée","2018-10-01"]
[null,null,null,null,null,null,null,null,null,null,null,null,"2021-10-01"]
[]
[{"$f":"\"Evolution du TP01 et du \"&$B$3","v":"Evolution du TP01 et du TP02"},null,null,null,null,null,null,null,null,null,{"$f":"\"Composition globale du \"&B3","v":"Composition globale du TP02"}]
[]
[null,null,null,null,null,null,{"$f":"\"Evolution entre \"&TEXT(date1,\"mmmm aaaa\")&\" et \"&TEXT(date2,\"mmmm aaaa\")","v":"Evolution entre octobre 2018 et octobre 2021"}]
[null,null,null,null,null,null,"TP01",{"$f":"SUM(IF((INDEX(base_index,1,)=$G9)*(INDEX(base_index,,1)=date2),INDEX(base_index,,),0))/SUM(IF((INDEX(base_index,1,)=$G9)*(INDEX(base_index,,1)=date1),INDEX(base_index,,),0))-1","v":5.9513074842200142E-2}]
[null,null,null,null,null,null,{"$f":"B3","v":"TP02"},{"$f":"IF(ISNA(SUM(IF((INDEX(base_index,1,)=$G10)*(INDEX(base_index,,1)=date2),INDEX(base_index,,),0))/SUM(IF((INDEX(base_index,1,)=$G10)*(INDEX(base_index,,1)=date1),INDEX(base_index,,),0))-1),\"-\",SUM(IF((INDEX(base_index,1,)=$G10)*(INDEX(base_index,,1)=date2),INDEX(base_index,,),0))/SUM(IF((INDEX(base_index,1,)=$G10)*(INDEX(base_index,,1)=date1),INDEX(base_index,,),0))-1)","v":9.3805309734513287E-2}]
[]
[null,null,null,null,null,null,{"$f":"\"Part du \"&B3&\" dans le TP01\"","v":"Part du TP02 dans le TP01"}]
[]
[]
[]
[]
[]
["Evolution des indices communs à la plupart des index"]
[null,null,null,null,{"$f":"\"Evolution entre \"&TEXT(date1,\"mmmm aaaa\")&\" et \"&TEXT(date2,\"mmmm aaaa\")","v":"Evolution entre octobre 2018 et octobre 2021"}]
[null,"Evolution entre février 2021 et août 2021",null,{"$f":"\"Part dans le \"&B3","v":"Part dans le TP02"}]
["Matériel",{"$f":"SUM(IF((INDEX(base_indices,1,)='Données dates variables'!$G5)*(INDEX(base_indices,,1)=date2),INDEX(base_indices,,),0))/SUM(IF((INDEX(base_indices,1,)='Données dates variables'!$G5)*(INDEX(base_indices,,1)=date1),INDEX(base_indices,,),0))-1","v":4.5062320230105479E-2},null,{"$f":"SUM(IF((INDEX(compo,3,)='Données dates variables'!G5)*(INDEX(compo,,1)=$B$3),INDEX(compo,,),0))","v":0.15}]
["Travail",{"$f":"SUM(IF((INDEX(base_indices,1,)='Données dates variables'!$G6)*(INDEX(base_indices,,1)=date2),INDEX(base_indices,,),0))/SUM(IF((INDEX(base_indices,1,)='Données dates variables'!$G6)*(INDEX(base_indices,,1)=date1),INDEX(base_indices,,),0))-1","v":2.506265664160412E-2},null,{"$f":"SUM(IF((INDEX(compo,3,)='Données dates variables'!G6)*(INDEX(compo,,1)=$B$3),INDEX(compo,,),0))","v":0.55000000000000004}]
["GNR",{"$f":"SUM(IF((INDEX(base_indices,1,)='Données dates variables'!$G7)*(INDEX(base_indices,,1)=date2),INDEX(base_indices,,),0))/SUM(IF((INDEX(base_indices,1,)='Données dates variables'!$G7)*(INDEX(base_indices,,1)=date1),INDEX(base_indices,,),0))-1","v":1.5060240963855609E-3},null,{"$f":"SUM(IF((INDEX(compo,3,)='Données dates variables'!G7)*(INDEX(compo,,1)=$B$3),INDEX(compo,,),0))","v":0}]
["Gazole",{"$f":"SUM(IF((INDEX(base_indices,1,)='Données dates variables'!$G8)*(INDEX(base_indices,,1)=date2),INDEX(base_indices,,),0))/SUM(IF((INDEX(base_indices,1,)='Données dates variables'!$G8)*(INDEX(base_indices,,1)=date1),INDEX(base_indices,,),0))-1","v":3.2588101553618909E-3},null,{"$f":"SUM(IF((INDEX(compo,3,)='Données dates variables'!G8)*(INDEX(compo,,1)=$B$3),INDEX(compo,,),0))","v":0}]
["Frais divers",{"$f":"SUM(IF((INDEX(base_indices,1,)='Données dates variables'!$G9)*(INDEX(base_indices,,1)=date2),INDEX(base_indices,,),0))/SUM(IF((INDEX(base_indices,1,)='Données dates variables'!$G9)*(INDEX(base_indices,,1)=date1),INDEX(base_indices,,),0))-1","v":3.1189083820662766E-2},null,{"$f":"SUM(IF((INDEX(compo,3,)='Données dates variables'!G9)*(INDEX(compo,,1)=$B$3),INDEX(compo,,),0))","v":0.01}]
["Transport",{"$f":"SUM(IF((INDEX(base_indices,1,)='Données dates variables'!$G10)*(INDEX(base_indices,,1)=date2),INDEX(base_indices,,),0))/SUM(IF((INDEX(base_indices,1,)='Données dates variables'!$G10)*(INDEX(base_indices,,1)=date1),INDEX(base_indices,,),0))-1","v":2.1256931608133023E-2},null,{"$f":"SUM(IF((INDEX(compo,3,)='Données dates variables'!G10)*(INDEX(compo,,1)=$B$3),INDEX(compo,,),0))","v":0.01}]
["Ensemble hors matériaux",null,null,{"$f":"SUM(D21:D26)","v":0.72000000000000008}]
[]
[{"$f":"IF(B3=\"TP14\",\"Frais divers hors Restaurants et hôtels\",IF(OR(B3=\"TP03a\",B3=\"TP03b\",B3=\"TP12d\"),\"Travail hors travail activités spécialisées\",\"\"))","v":""}]
[{"$f":"\"Evolution des indices spécifiques au \"&B3","v":"Evolution des indices spécifiques au TP02"}]
[{"$f":"IF(ISNA(VLOOKUP($B$3,'Indice prix'!$A$69:$B$74,2,FALSE)),\"\",VLOOKUP($B$3,'Indice prix'!$A$69:$B$74,2,FALSE))","v":""},null,null,null,null,null,{"$f":"\"Evolution entre \"&TEXT(date1,\"mmmm aaaa\")&\" et \"&TEXT(date2,\"mmmm aaaa\")","v":"Evolution entre octobre 2018 et octobre 2021"},null,{"$f":"IF(A32=\"\",\"\",\"Part dans le \"&B3)","v":"Part dans le TP02"}]
[{"$f":"IF('Données dates variables'!M3<>0,'Données dates variables'!L3,\"\")","v":"Béton prêt à l'emploi"},null,null,null,null,null,{"$f":"IF('Données dates variables'!$M3<>0,'Données dates variables'!O3,\"\")","v":4.1095890410958846E-2},null,{"$f":"IF('Données dates variables'!M3<>0,'Données dates variables'!M3,\"\")","v":0.12}]
[{"$f":"IF('Données dates variables'!M4<>0,'Données dates variables'!L4,\"\")","v":"Barres crénelées ou nervurées pour béton armé"},null,null,null,null,null,{"$f":"IF('Données dates variables'!$M4<>0,'Données dates variables'!O4,\"\")","v":0.51017214397496091},null,{"$f":"IF('Données dates variables'!M4<>0,'Données dates variables'!M4,\"\")","v":0.09}]
[{"$f":"IF('Données dates variables'!M5<>0,'Données dates variables'!L5,\"\")","v":"Tubes, tuyaux en matière plastique"},null,null,null,null,null,{"$f":"IF('Données dates variables'!$M5<>0,'Données dates variables'!O5,\"\")","v":0.22637795275590555},null,{"$f":"IF('Données dates variables'!M5<>0,'Données dates variables'!M5,\"\")","v":0.04}]
[{"$f":"IF('Données dates variables'!M6<>0,'Données dates variables'!L6,\"\")","v":"Ensemble des produits du sciage"},null,null,null,null,null,{"$f":"IF('Données dates variables'!$M6<>0,'Données dates variables'!O6,\"\")","v":0.25594149908592323},null,{"$f":"IF('Données dates variables'!M6<>0,'Données dates variables'!M6,\"\")","v":0.02}]
[{"$f":"IF('Données dates variables'!M7<>0,'Données dates variables'!L7,\"\")","v":"Électricité vendue aux entreprises consommatrices finales"},null,null,null,null,null,{"$f":"IF('Données dates variables'!$M7<>0,'Données dates variables'!O7,\"\")","v":0.12990936555891253},null,{"$f":"IF('Données dates variables'!M7<>0,'Données dates variables'!M7,\"\")","v":0.01}]
[{"$f":"IF('Données dates variables'!M8<>0,'Données dates variables'!L8,\"\")","v":""},null,null,null,null,null,{"$f":"IF('Données dates variables'!$M8<>0,'Données dates variables'!O8,\"\")","v":""},null,{"$f":"IF('Données dates variables'!M8<>0,'Données dates variables'!M8,\"\")","v":""}]
[{"$f":"IF('Données dates variables'!M9<>0,'Données dates variables'!L9,\"\")","v":""},null,null,null,null,null,{"$f":"IF('Données dates variables'!$M9<>0,'Données dates variables'!O9,\"\")","v":""},null,{"$f":"IF('Données dates variables'!M9<>0,'Données dates variables'!M9,\"\")","v":""}]
[{"$f":"IF('Données dates variables'!M10<>0,'Données dates variables'!L10,\"\")","v":""},null,null,null,null,null,{"$f":"IF('Données dates variables'!$M10<>0,'Données dates variables'!O10,\"\")","v":""},null,{"$f":"IF('Données dates variables'!M10<>0,'Données dates variables'!M10,\"\")","v":""}]
[{"$f":"IF('Données dates variables'!M11<>0,'Données dates variables'!L11,\"\")","v":""},null,null,null,null,null,{"$f":"IF('Données dates variables'!$M11<>0,'Données dates variables'!O11,\"\")","v":""},null,{"$f":"IF('Données dates variables'!M11<>0,'Données dates variables'!M11,\"\")","v":""},{"$f":"IF(OR(A32=\"Travail activités spécialisées\",A32=\"Fils et câbles d'énergie\",A32=\"Tuyaux d'assainissement\"),\"juillet 2021 = juin 2021\",\"\")","v":""}]

{"sheet":"Données dates variables","index":21,"n_rows":71,"n_cols":19,"rows_kept":71,"cut":false,"hidden":true,"merged":[]}
[{"$f":"date1","v":"2018-10-01"},null,"2021-09-01","septembre",null,null,null,null,null,{"$f":"'Résultats date à date'!B3","v":"TP02"}]
[{"$f":"date2","v":"2021-10-01"}]
[{"$f":"SUM(IF((INDEX(compo,2,)=\"TP01\")*(INDEX(compo,,1)=$C$13),INDEX(compo,,),0))","v":0.1},null,null,null,null,null,null,null,null,{"$f":"OFFSET('Composition index'!$J$2,0,R3)","v":"Travail activités spécialisées"},{"$f":"SUM(IF((INDEX(compo,2,)='Données dates variables'!J3)*(INDEX(compo,,1)=$J$1),INDEX(compo,,),0))","v":0},{"$f":"_xlfn._xlws.SORT(J3:K37,2,-1)","v":"Béton prêt à l'emploi"},0.12,{"$f":"HLOOKUP(L3,'Composition index'!$A$2:$AR$3,2,FALSE)","v":"010534646"},{"$f":"SUM(IF((INDEX(base_indices,1,)=N3)*(INDEX(base_indices,,1)=date2),INDEX(base_indices,,),0))/SUM(IF((INDEX(base_indices,1,)=N3)*(INDEX(base_indices,,1)=date1),INDEX(base_indices,,),0))-1","v":4.1095890410958846E-2},null,{"$f":"INDEX('Indice prix'!$B$1:$AP$2,1,MATCH('Données dates variables'!N3,'Indice prix'!$B$2:$AP$2,0))","v":"base 2015"},null,{"$f":"IF(M3=0,\"\",\"base 100 en \"&RIGHT(Q3,4))","v":"base 100 en 2015"}]
[null,null,null,null,null,null,null,null,null,{"$f":"OFFSET('Composition index'!$J$2,0,R4)","v":"Électricité vendue aux entreprises consommatrices finales"},{"$f":"SUM(IF((INDEX(compo,2,)='Données dates variables'!J4)*(INDEX(compo,,1)=$J$1),INDEX(compo,,),0))","v":0.01},"Barres crénelées ou nervurées pour béton armé",0.09,{"$f":"HLOOKUP(L4,'Composition index'!$A$2:$AR$3,2,FALSE)","v":"010546545"},{"$f":"SUM(IF((INDEX(base_indices,1,)=N4)*(INDEX(base_indices,,1)=date2),INDEX(base_indices,,),0))/SUM(IF((INDEX(base_indices,1,)=N4)*(INDEX(base_indices,,1)=date1),INDEX(base_indices,,),0))-1","v":0.51017214397496091},null,{"$f":"INDEX('Indice prix'!$B$1:$AP$2,1,MATCH('Données dates variables'!N4,'Indice prix'!$B$2:$AP$2,0))","v":"base 2015"},1,{"$f":"IF(M4=0,\"\",\"base 100 en \"&RIGHT(Q4,4))","v":"base 100 en 2015"}]
["K","Matériel",{"$f":"SUM(IF((INDEX(compo,1,)='Données dates variables'!A5)*(INDEX(compo,,1)=$J$1),INDEX(compo,,),0))","v":0.15},null,null,null,"001711009","Matériel",null,{"$f":"OFFSET('Composition index'!$J$2,0,R5)","v":"Fioul lourd"},{"$f":"SUM(IF((INDEX(compo,2,)='Données dates variables'!J5)*(INDEX(compo,,1)=$J$1),INDEX(compo,,),0))","v":0},"Tubes, tuyaux en matière plastique",0.04,{"$f":"HLOOKUP(L5,'Composition index'!$A$2:$AR$3,2,FALSE)","v":"010534207"},{"$f":"SUM(IF((INDEX(base_indices,1,)=N5)*(INDEX(base_indices,,1)=date2),INDEX(base_indices,,),0))/SUM(IF((INDEX(base_indices,1,)=N5)*(INDEX(base_indices,,1)=date1),INDEX(base_indices,,),0))-1","v":0.22637795275590555},null,null,2]
["L","Travail",{"$f":"SUM(IF((INDEX(compo,1,)='Données dates variables'!A6)*(INDEX(compo,,1)=$J$1),INDEX(compo,,),0))","v":0.55000000000000004},null,null,null,"5540998","Travail",null,{"$f":"OFFSET('Composition index'!$J$2,0,R6)","v":"Gazole routier HTT"},{"$f":"SUM(IF((INDEX(compo,2,)='Données dates variables'!J6)*(INDEX(compo,,1)=$J$1),INDEX(compo,,),0))","v":0},"Ensemble des produits du sciage",0.02,{"$f":"HLOOKUP(L6,'Composition index'!$A$2:$AR$3,2,FALSE)","v":"010534575"},{"$f":"SUM(IF((INDEX(base_indices,1,)=N6)*(INDEX(base_indices,,1)=date2),INDEX(base_indices,,),0))/SUM(IF((INDEX(base_indices,1,)=N6)*(INDEX(base_indices,,1)=date1),INDEX(base_indices,,),0))-1","v":0.25594149908592323},null,null,3]
["E","Energie",{"$f":"SUM(IF((INDEX(compo,1,)='Données dates variables'!A7)*(INDEX(compo,,1)=$J$1),INDEX(compo,,),0))","v":0.01},null,null,null,"010534596","GNR",null,{"$f":"OFFSET('Composition index'!$J$2,0,R7)","v":"Tubes, tuyaux en matière plastique"},{"$f":"SUM(IF((INDEX(compo,2,)='Données dates variables'!J7)*(INDEX(compo,,1)=$J$1),INDEX(compo,,),0))","v":0.04},"Électricité vendue aux entreprises consommatrices finales",0.01,{"$f":"HLOOKUP(L7,'Composition index'!$A$2:$AR$3,2,FALSE)","v":"010534769"},{"$f":"SUM(IF((INDEX(base_indices,1,)=N7)*(INDEX(base_indices,,1)=date2),INDEX(base_indices,,),0))/SUM(IF((INDEX(base_indices,1,)=N7)*(INDEX(base_indices,,1)=date1),INDEX(base_indices,,),0))-1","v":0.12990936555891253},null,null,4]
["M","Matériaux",{"$f":"SUM(IF((INDEX(compo,1,)='Données dates variables'!A8)*(INDEX(compo,,1)=$J$1),INDEX(compo,,),0))","v":0.27},null,null,null,"001764283","Gazole",null,{"$f":"OFFSET('Composition index'!$J$2,0,R8)","v":"Ensemble des produits du sciage"},{"$f":"SUM(IF((INDEX(compo,2,)='Données dates variables'!J8)*(INDEX(compo,,1)=$J$1),INDEX(compo,,),0))","v":0.02},"Travail activités spécialisées",0,{"$f":"HLOOKUP(L8,'Composition index'!$A$2:$AR$3,2,FALSE)","v":"001565195"},{"$f":"SUM(IF((INDEX(base_indices,1,)=N8)*(INDEX(base_indices,,1)=date2),INDEX(base_indices,,),0))/SUM(IF((INDEX(base_indices,1,)=N8)*(INDEX(base_indices,,1)=date1),INDEX(base_indices,,),0))-1","v":4.4991511035653575E-2},null,null,5]
["S","Frais divers",{"$f":"SUM(IF((INDEX(compo,1,)='Données dates variables'!A9)*(INDEX(compo,,1)=$J$1),INDEX(compo,,),0))","v":0.01},null,null,null,"001711011","Frais divers",null,{"$f":"OFFSET('Composition index'!$J$2,0,R9)","v":"Béton prêt à l'emploi"},{"$f":"SUM(IF((INDEX(compo,2,)='Données dates variables'!J9)*(INDEX(compo,,1)=$J$1),INDEX(compo,,),0))","v":0.12},"Fioul lourd",0,{"$f":"HLOOKUP(L9,'Composition index'!$A$2:$AR$3,2,FALSE)","v":"Fioul lourd"},{"$f":"SUM(IF((INDEX(base_indices,1,)=N9)*(INDEX(base_indices,,1)=date2),INDEX(base_indices,,),0))/SUM(IF((INDEX(base_indices,1,)=N9)*(INDEX(base_indices,,1)=date1),INDEX(base_indices,,),0))-1","v":-0.20194238655854491},null,null,6]
["T","Transport",{"$f":"SUM(IF((INDEX(compo,1,)='Données dates variables'!A10)*(INDEX(compo,,1)=$J$1),INDEX(compo,,),0))","v":0.01},null,null,null,"001711943","Transports routiers",null,{"$f":"OFFSET('Composition index'!$J$2,0,R10)","v":"Barres crénelées ou nervurées pour béton armé"},{"$f":"SUM(IF((INDEX(compo,2,)='Données dates variables'!J10)*(INDEX(compo,,1)=$J$1),INDEX(compo,,),0))","v":0.09},"Gazole routier HTT",0,{"$f":"HLOOKUP(L10,'Composition index'!$A$2:$AR$3,2,FALSE)","v":"Gazole routier HTT"},{"$f":"SUM(IF((INDEX(base_indices,1,)=N10)*(INDEX(base_indices,,1)=date2),INDEX(base_indices,,),0))/SUM(IF((INDEX(base_indices,1,)=N10)*(INDEX(base_indices,,1)=date1),INDEX(base_indices,,),0))-1","v":-0.17834903826752946},null,null,7]
["D","Déchets",{"$f":"SUM(IF((INDEX(compo,1,)='Données dates variables'!A11)*(INDEX(compo,,1)=$J$1),INDEX(compo,,),0))","v":0},null,null,null,null,null,null,{"$f":"OFFSET('Composition index'!$J$2,0,R11)","v":"Sables et granulats"},{"$f":"SUM(IF((INDEX(compo,2,)='Données dates variables'!J11)*(INDEX(compo,,1)=$J$1),INDEX(compo,,),0))","v":0},"Sables et granulats",0,{"$f":"HLOOKUP(L11,'Composition index'!$A$2:$AR$3,2,FALSE)","v":"010536067"},{"$f":"SUM(IF((INDEX(base_indices,1,)=N11)*(INDEX(base_indices,,1)=date2),INDEX(base_indices,,),0))/SUM(IF((INDEX(base_indices,1,)=N11)*(INDEX(base_indices,,1)=date1),INDEX(base_indices,,),0))-1","v":3.400000000000003E-2},null,null,8]
[null,null,null,"Matériel","Travail","GNR",{"$f":"HLOOKUP(G13,'Indice prix'!$B$2:$AP$5,4,FALSE)","v":"Béton prêt à l'emploi"},{"$f":"HLOOKUP(H13,'Indice prix'!$B$2:$AP$5,4,FALSE)","v":"Barres crénelées ou nervurées pour béton armé"},null,{"$f":"OFFSET('Composition index'!$J$2,0,R12)","v":"Plaques, feuilles, tubes et profilés en matières plastiques"},{"$f":"SUM(IF((INDEX(compo,2,)='Données dates variables'!J12)*(INDEX(compo,,1)=$J$1),INDEX(compo,,),0))","v":0},"Plaques, feuilles, tubes et profilés en matières plastiques",0,{"$f":"HLOOKUP(L12,'Composition index'!$A$2:$AR$3,2,FALSE)","v":"010534625"},{"$f":"SUM(IF((INDEX(base_indices,1,)=N12)*(INDEX(base_indices,,1)=date2),INDEX(base_indices,,),0))/SUM(IF((INDEX(base_indices,1,)=N12)*(INDEX(base_indices,,1)=date1),INDEX(base_indices,,),0))-1","v":0.17996108949416345},null,null,9]
[null,"TP01",{"$f":"J1","v":"TP02"},{"$f":"HLOOKUP(D12,'Composition index'!$A$2:$AR$3,2,FALSE)","v":"001711009"},{"$f":"HLOOKUP(E12,'Composition index'!$A$2:$AR$3,2,FALSE)","v":"5540998"},{"$f":"HLOOKUP(F12,'Composition index'!$A$2:$AR$3,2,FALSE)","v":"010534596"},{"$f":"IF(M3>0,N3,\"\")","v":"010534646"},{"$f":"IF(M4>0,N4,\"\")","v":"010546545"},null,{"$f":"OFFSET('Composition index'!$J$2,0,R13)","v":"Ciment, chaux et plâtre"},{"$f":"SUM(IF((INDEX(compo,2,)='Données dates variables'!J13)*(INDEX(compo,,1)=$J$1),INDEX(compo,,),0))","v":0},"Ciment, chaux et plâtre",0,{"$f":"HLOOKUP(L13,'Composition index'!$A$2:$AR$3,2,FALSE)","v":"010534642"},{"$f":"SUM(IF((INDEX(base_indices,1,)=N13)*(INDEX(base_indices,,1)=date2),INDEX(base_indices,,),0))/SUM(IF((INDEX(base_indices,1,)=N13)*(INDEX(base_indices,,1)=date1),INDEX(base_indices,,),0))-1","v":6.9207622868605823E-2},null,null,10]
[{"$f":"date1","v":"2018-10-01"},{"$f":"IF(A14>date2,\"\",SUM(IF((INDEX(base_index,1,)=B$13)*(INDEX(base_index,,1)=$A14),INDEX(base_index,,),0)))","v":110.9},{"$f":"IF(A14>date2,\"\",SUM(IF((INDEX(base_index,1,)=C$13)*(INDEX(base_index,,1)=$A14),INDEX(base_index,,),0)))","v":113},{"$f":"IF($A14>date2,\"\",SUM(IF((INDEX(base_indices,1,)=D$13)*(INDEX(base_indices,,1)=$A14),INDEX(base_indices,,),0)))","v":104.3},{"$f":"IF($A14>date2,\"\",SUM(IF((INDEX(base_indices,1,)=E$13)*(INDEX(base_indices,,1)=$A14),INDEX(base_indices,,),0)))","v":119.7},{"$f":"IF($A14>date2,\"\",SUM(IF((INDEX(base_indices,1,)=F$13)*(INDEX(base_indices,,1)=$A14),INDEX(base_indices,,),0)))","v":132.80000000000001},{"$f":"IF($A14>date2,\"\",SUM(IF((INDEX(base_indices,1,)=G$13)*(INDEX(base_indices,,1)=$A14),INDEX(base_indices,,),0)))","v":102.2},{"$f":"IF($A14>date2,\"\",SUM(IF((INDEX(base_indices,1,)=H$13)*(INDEX(base_indices,,1)=$A14),INDEX(base_indices,,),0)))","v":127.8},null,{"$f":"OFFSET('Composition index'!$J$2,0,R14)","v":"Produits explosifs"},{"$f":"SUM(IF((INDEX(compo,2,)='Données dates variables'!J14)*(INDEX(compo,,1)=$J$1),INDEX(compo,,),0))","v":0},"Produits explosifs",0,{"$f":"HLOOKUP(L14,'Composition index'!$A$2:$AR$3,2,FALSE)","v":"010534614"},{"$f":"SUM(IF((INDEX(base_indices,1,)=N14)*(INDEX(base_indices,,1)=date2),INDEX(base_indices,,),0))/SUM(IF((INDEX(base_indices,1,)=N14)*(INDEX(base_indices,,1)=date1),INDEX(base_indices,,),0))-1","v":1.1650485436893288E-2},null,null,11]
[{"$f":"IF(A14=\"\",\"\",IF(EDATE(A14,1)>date2,\"\",EDATE(A14,1)))","v":"2018-11-01"},{"$f":"IF(A15>date2,\"\",SUM(IF((INDEX(base_index,1,)=B$13)*(INDEX(base_index,,1)=$A15),INDEX(base_index,,),0)))","v":111.1},{"$f":"IF(A15>date2,\"\",SUM(IF((INDEX(base_index,1,)=C$13)*(INDEX(base_index,,1)=$A15),INDEX(base_index,,),0)))","v":113.1},{"$f":"IF($A15>date2,\"\",SUM(IF((INDEX(base_indices,1,)=D$13)*(INDEX(base_indices,,1)=$A15),INDEX(base_indices,,),0)))","v":104.3},{"$f":"IF($A15>date2,\"\",SUM(IF((INDEX(base_indices,1,)=E$13)*(INDEX(base_indices,,1)=$A15),INDEX(base_indices,,),0)))","v":120},{"$f":"IF($A15>date2,\"\",SUM(IF((INDEX(base_indices,1,)=F$13)*(INDEX(base_indices,,1)=$A15),INDEX(base_indices,,),0)))","v":125.8},{"$f":"IF($A15>date2,\"\",SUM(IF((INDEX(base_indices,1,)=G$13)*(INDEX(base_indices,,1)=$A15),INDEX(base_indices,,),0)))","v":102.4},{"$f":"IF($A15>date2,\"\",SUM(IF((INDEX(base_indices,1,)=H$13)*(INDEX(base_indices,,1)=$A15),INDEX(base_indices,,),0)))","v":126.6},null,{"$f":"OFFSET('Composition index'!$J$2,0,R15)","v":"Acier pour la construction"},{"$f":"SUM(IF((INDEX(compo,2,)='Données dates variables'!J15)*(INDEX(compo,,1)=$J$1),INDEX(compo,,),0))","v":0},"Acier pour la construction",0,{"$f":"HLOOKUP(L15,'Composition index'!$A$2:$AR$3,2,FALSE)","v":"010536462"},{"$f":"SUM(IF((INDEX(base_indices,1,)=N15)*(INDEX(base_indices,,1)=date2),INDEX(base_indices,,),0))/SUM(IF((INDEX(base_indices,1,)=N15)*(INDEX(base_indices,,1)=date1),INDEX(base_indices,,),0))-1","v":0.54935275080906165},null,null,12]
["2018-12-01",{"$f":"IF(A16>date2,\"\",SUM(IF((INDEX(base_index,1,)=B$13)*(INDEX(base_index,,1)=$A16),INDEX(base_index,,),0)))","v":110},{"$f":"IF(A16>date2,\"\",SUM(IF((INDEX(base_index,1,)=C$13)*(INDEX(base_index,,1)=$A16),INDEX(base_index,,),0)))","v":113.2},{"$f":"IF($A16>date2,\"\",SUM(IF((INDEX(base_indices,1,)=D$13)*(INDEX(base_indices,,1)=$A16),INDEX(base_indices,,),0)))","v":104.1},{"$f":"IF($A16>date2,\"\",SUM(IF((INDEX(base_indices,1,)=E$13)*(INDEX(base_indices,,1)=$A16),INDEX(base_indices,,),0)))","v":120.2},{"$f":"IF($A16>date2,\"\",SUM(IF((INDEX(base_indices,1,)=F$13)*(INDEX(base_indices,,1)=$A16),INDEX(base_indices,,),0)))","v":118.1},{"$f":"IF($A16>date2,\"\",SUM(IF((INDEX(base_indices,1,)=G$13)*(INDEX(base_indices,,1)=$A16),INDEX(base_indices,,),0)))","v":102.2},{"$f":"IF($A16>date2,\"\",SUM(IF((INDEX(base_indices,1,)=H$13)*(INDEX(base_indices,,1)=$A16),INDEX(base_indices,,),0)))","v":125.5},null,{"$f":"OFFSET('Composition index'!$J$2,0,R16)","v":"Bitume"},{"$f":"SUM(IF((INDEX(compo,2,)='Données dates variables'!J16)*(INDEX(compo,,1)=$J$1),INDEX(compo,,),0))","v":0},"Bitume",0,{"$f":"HLOOKUP(L16,'Composition index'!$A$2:$AR$3,2,FALSE)","v":"010534598"},{"$f":"SUM(IF((INDEX(base_indices,1,)=N16)*(INDEX(base_indices,,1)=date2),INDEX(base_indices,,),0))/SUM(IF((INDEX(base_indices,1,)=N16)*(INDEX(base_indices,,1)=date1),INDEX(base_indices,,),0))-1","v":0.15244667503136755},null,null,13]
["2019-01-01",{"$f":"IF(A17>date2,\"\",SUM(IF((INDEX(base_index,1,)=B$13)*(INDEX(base_index,,1)=$A17),INDEX(base_index,,),0)))","v":109.7},{"$f":"IF(A17>date2,\"\",SUM(IF((INDEX(base_index,1,)=C$13)*(INDEX(base_index,,1)=$A17),INDEX(base_index,,),0)))","v":113.5},{"$f":"IF($A17>date2,\"\",SUM(IF((INDEX(base_indices,1,)=D$13)*(INDEX(base_indices,,1)=$A17),INDEX(base_indices,,),0)))","v":104.7},{"$f":"IF($A17>date2,\"\",SUM(IF((INDEX(base_indices,1,)=E$13)*(INDEX(base_indices,,1)=$A17),INDEX(base_indices,,),0)))","v":120.8},{"$f":"IF($A17>date2,\"\",SUM(IF((INDEX(base_indices,1,)=F$13)*(INDEX(base_indices,,1)=$A17),INDEX(base_indices,,),0)))","v":118.2},{"$f":"IF($A17>date2,\"\",SUM(IF((INDEX(base_indices,1,)=G$13)*(INDEX(base_indices,,1)=$A17),INDEX(base_indices,,),0)))","v":103.8},{"$f":"IF($A17>date2,\"\",SUM(IF((INDEX(base_indices,1,)=H$13)*(INDEX(base_indices,,1)=$A17),INDEX(base_indices,,),0)))","v":124.6},null,{"$f":"OFFSET('Composition index'!$J$2,0,R17)","v":"Produits de voierie en béton"},{"$f":"SUM(IF((INDEX(compo,2,)='Données dates variables'!J17)*(INDEX(compo,,1)=$J$1),INDEX(compo,,),0))","v":0},"Produits de voierie en béton",0,{"$f":"HLOOKUP(L17,'Composition index'!$A$2:$AR$3,2,FALSE)","v":"010534252"},{"$f":"SUM(IF((INDEX(base_indices,1,)=N17)*(INDEX(base_indices,,1)=date2),INDEX(base_indices,,),0))/SUM(IF((INDEX(base_indices,1,)=N17)*(INDEX(base_indices,,1)=date1),INDEX(base_indices,,),0))-1","v":0.14373716632443534},null,null,14]
["2019-02-01",{"$f":"IF(A18>date2,\"\",SUM(IF((INDEX(base_index,1,)=B$13)*(INDEX(base_index,,1)=$A18),INDEX(base_index,,),0)))","v":110.3},{"$f":"IF(A18>date2,\"\",SUM(IF((INDEX(base_index,1,)=C$13)*(INDEX(base_index,,1)=$A18),INDEX(base_index,,),0)))","v":113.6},{"$f":"IF($A18>date2,\"\",SUM(IF((INDEX(base_indices,1,)=D$13)*(INDEX(base_indices,,1)=$A18),INDEX(base_indices,,),0)))","v":104.7},{"$f":"IF($A18>date2,\"\",SUM(IF((INDEX(base_indices,1,)=E$13)*(INDEX(base_indices,,1)=$A18),INDEX(base_indices,,),0)))","v":121.4},{"$f":"IF($A18>date2,\"\",SUM(IF((INDEX(base_indices,1,)=F$13)*(INDEX(base_indices,,1)=$A18),INDEX(base_indices,,),0)))","v":122.5},{"$f":"IF($A18>date2,\"\",SUM(IF((INDEX(base_indices,1,)=G$13)*(INDEX(base_indices,,1)=$A18),INDEX(base_indices,,),0)))","v":104.2},{"$f":"IF($A18>date2,\"\",SUM(IF((INDEX(base_indices,1,)=H$13)*(INDEX(base_indices,,1)=$A18),INDEX(base_indices,,),0)))","v":123.8},null,{"$f":"OFFSET('Composition index'!$J$2,0,R18)","v":"Mortiers et bétons secs"},{"$f":"SUM(IF((INDEX(compo,2,)='Données dates variables'!J18)*(INDEX(compo,,1)=$J$1),INDEX(compo,,),0))","v":0},"Mortiers et bétons secs",0,{"$f":"HLOOKUP(L18,'Composition index'!$A$2:$AR$3,2,FALSE)","v":"010534647"},{"$f":"SUM(IF((INDEX(base_indices,1,)=N18)*(INDEX(base_indices,,1)=date2),INDEX(base_indices,,),0))/SUM(IF((INDEX(base_indices,1,)=N18)*(INDEX(base_indices,,1)=date1),INDEX(base_indices,,),0))-1","v":4.6653144016227222E-2},null,null,15]
["2019-03-01",{"$f":"IF(A19>date2,\"\",SUM(IF((INDEX(base_index,1,)=B$13)*(INDEX(base_index,,1)=$A19),INDEX(base_index,,),0)))","v":111.3},{"$f":"IF(A19>date2,\"\",SUM(IF((INDEX(base_index,1,)=C$13)*(INDEX(base_index,,1)=$A19),INDEX(base_index,,),0)))","v":114.1},{"$f":"IF($A19>date2,\"\",SUM(IF((INDEX(base_indices,1,)=D$13)*(INDEX(base_indices,,1)=$A19),INDEX(base_indices,,),0)))","v":105.7},{"$f":"IF($A19>date2,\"\",SUM(IF((INDEX(base_indices,1,)=E$13)*(INDEX(base_indices,,1)=$A19),INDEX(base_indices,,),0)))","v":122},{"$f":"IF($A19>date2,\"\",SUM(IF((INDEX(base_indices,1,)=F$13)*(INDEX(base_indices,,1)=$A19),INDEX(base_indices,,),0)))","v":123.5},{"$f":"IF($A19>date2,\"\",SUM(IF((INDEX(base_indices,1,)=G$13)*(INDEX(base_indices,,1)=$A19),INDEX(base_indices,,),0)))","v":104.3},{"$f":"IF($A19>date2,\"\",SUM(IF((INDEX(base_indices,1,)=H$13)*(INDEX(base_indices,,1)=$A19),INDEX(base_indices,,),0)))","v":123.9},null,{"$f":"OFFSET('Composition index'!$J$2,0,R19)","v":"Travaux de fonderie de fonte"},{"$f":"SUM(IF((INDEX(compo,2,)='Données dates variables'!J19)*(INDEX(compo,,1)=$J$1),INDEX(compo,,),0))","v":0},"Travaux de fonderie de fonte",0,{"$f":"HLOOKUP(L19,'Composition index'!$A$2:$AR$3,2,FALSE)","v":"010534662"},{"$f":"SUM(IF((INDEX(base_indices,1,)=N19)*(INDEX(base_indices,,1)=date2),INDEX(base_indices,,),0))/SUM(IF((INDEX(base_indices,1,)=N19)*(INDEX(base_indices,,1)=date1),INDEX(base_indices,,),0))-1","v":0.12460063897763574},null,null,16]
["2019-04-01",{"$f":"IF(A20>date2,\"\",SUM(IF((INDEX(base_index,1,)=B$13)*(INDEX(base_index,,1)=$A20),INDEX(base_index,,),0)))","v":111.6},{"$f":"IF(A20>date2,\"\",SUM(IF((INDEX(base_index,1,)=C$13)*(INDEX(base_index,,1)=$A20),INDEX(base_index,,),0)))","v":114.1},{"$f":"IF($A20>date2,\"\",SUM(IF((INDEX(base_indices,1,)=D$13)*(INDEX(base_indices,,1)=$A20),INDEX(base_indices,,),0)))","v":105.3},{"$f":"IF($A20>date2,\"\",SUM(IF((INDEX(base_indices,1,)=E$13)*(INDEX(base_indices,,1)=$A20),INDEX(base_indices,,),0)))","v":122.3},{"$f":"IF($A20>date2,\"\",SUM(IF((INDEX(base_indices,1,)=F$13)*(INDEX(base_indices,,1)=$A20),INDEX(base_indices,,),0)))","v":125.8},{"$f":"IF($A20>date2,\"\",SUM(IF((INDEX(base_indices,1,)=G$13)*(INDEX(base_indices,,1)=$A20),INDEX(base_indices,,),0)))","v":104.1},{"$f":"IF($A20>date2,\"\",SUM(IF((INDEX(base_indices,1,)=H$13)*(INDEX(base_indices,,1)=$A20),INDEX(base_indices,,),0)))","v":123.8},null,{"$f":"OFFSET('Composition index'!$J$2,0,R20)","v":"Tuiles, briques et produits de construction en terre cuite"},{"$f":"SUM(IF((INDEX(compo,2,)='Données dates variables'!J20)*(INDEX(compo,,1)=$J$1),INDEX(compo,,),0))","v":0},"Tuiles, briques et produits de construction en terre cuite",0,{"$f":"HLOOKUP(L20,'Composition index'!$A$2:$AR$3,2,FALSE)","v":"010534638"},{"$f":"SUM(IF((INDEX(base_indices,1,)=N20)*(INDEX(base_indices,,1)=date2),INDEX(base_indices,,),0))/SUM(IF((INDEX(base_indices,1,)=N20)*(INDEX(base_indices,,1)=date1),INDEX(base_indices,,),0))-1","v":4.8659384309831077E-2},null,null,17]
["2019-05-01",{"$f":"IF(A21>date2,\"\",SUM(IF((INDEX(base_index,1,)=B$13)*(INDEX(base_index,,1)=$A21),INDEX(base_index,,),0)))","v":111.8},{"$f":"IF(A21>date2,\"\",SUM(IF((INDEX(base_index,1,)=C$13)*(INDEX(base_index,,1)=$A21),INDEX(base_index,,),0)))","v":114.1},{"$f":"IF($A21>date2,\"\",SUM(IF((INDEX(base_indices,1,)=D$13)*(INDEX(base_indices,,1)=$A21),INDEX(base_indices,,),0)))","v":105},{"$f":"IF($A21>date2,\"\",SUM(IF((INDEX(base_indices,1,)=E$13)*(INDEX(base_indices,,1)=$A21),INDEX(base_indices,,),0)))","v":122.5},{"$f":"IF($A21>date2,\"\",SUM(IF((INDEX(base_indices,1,)=F$13)*(INDEX(base_indices,,1)=$A21),INDEX(base_indices,,),0)))","v":126.4},{"$f":"IF($A21>date2,\"\",SUM(IF((INDEX(base_indices,1,)=G$13)*(INDEX(base_indices,,1)=$A21),INDEX(base_indices,,),0)))","v":104.9},{"$f":"IF($A21>date2,\"\",SUM(IF((INDEX(base_indices,1,)=H$13)*(INDEX(base_indices,,1)=$A21),INDEX(base_indices,,),0)))","v":123},null,{"$f":"OFFSET('Composition index'!$J$2,0,R21)","v":"Tuyaux d'assainissement"},{"$f":"SUM(IF((INDEX(compo,2,)='Données dates variables'!J21)*(INDEX(compo,,1)=$J$1),INDEX(compo,,),0))","v":0},"Tuyaux d'assainissement",0,{"$f":"HLOOKUP(L21,'Composition index'!$A$2:$AR$3,2,FALSE)","v":"010534253"},{"$f":"SUM(IF((INDEX(base_indices,1,)=N21)*(INDEX(base_indices,,1)=date2),INDEX(base_indices,,),0))/SUM(IF((INDEX(base_indices,1,)=N21)*(INDEX(base_indices,,1)=date1),INDEX(base_indices,,),0))-1","v":6.6476733143399747E-2},null,null,18]
["2019-06-01",{"$f":"IF(A22>date2,\"\",SUM(IF((INDEX(base_index,1,)=B$13)*(INDEX(base_index,,1)=$A22),INDEX(base_index,,),0)))","v":111.5},{"$f":"IF(A22>date2,\"\",SUM(IF((INDEX(base_index,1,)=C$13)*(INDEX(base_index,,1)=$A22),INDEX(base_index,,),0)))","v":114.3},{"$f":"IF($A22>date2,\"\",SUM(IF((INDEX(base_indices,1,)=D$13)*(INDEX(base_indices,,1)=$A22),INDEX(base_indices,,),0)))","v":104.9},{"$f":"IF($A22>date2,\"\",SUM(IF((INDEX(base_indices,1,)=E$13)*(INDEX(base_indices,,1)=$A22),INDEX(base_indices,,),0)))","v":122.7},{"$f":"IF($A22>date2,\"\",SUM(IF((INDEX(base_indices,1,)=F$13)*(INDEX(base_indices,,1)=$A22),INDEX(base_indices,,),0)))","v":119.9},{"$f":"IF($A22>date2,\"\",SUM(IF((INDEX(base_indices,1,)=G$13)*(INDEX(base_indices,,1)=$A22),INDEX(base_indices,,),0)))","v":105.3},{"$f":"IF($A22>date2,\"\",SUM(IF((INDEX(base_indices,1,)=H$13)*(INDEX(base_indices,,1)=$A22),INDEX(base_indices,,),0)))","v":122},null,{"$f":"OFFSET('Composition index'!$J$2,0,R22)","v":"Autres textiles n.c.a."},{"$f":"SUM(IF((INDEX(compo,2,)='Données dates variables'!J22)*(INDEX(compo,,1)=$J$1),INDEX(compo,,),0))","v":0},"Autres textiles n.c.a.",0,{"$f":"HLOOKUP(L22,'Composition index'!$A$2:$AR$3,2,FALSE)","v":"010534559"},{"$f":"SUM(IF((INDEX(base_indices,1,)=N22)*(INDEX(base_indices,,1)=date2),INDEX(base_indices,,),0))/SUM(IF((INDEX(base_indices,1,)=N22)*(INDEX(base_indices,,1)=date1),INDEX(base_indices,,),0))-1","v":1.9644527595883865E-2},null,null,19]
["2019-07-01",{"$f":"IF(A23>date2,\"\",SUM(IF((INDEX(base_index,1,)=B$13)*(INDEX(base_index,,1)=$A23),INDEX(base_index,,),0)))","v":111.5},{"$f":"IF(A23>date2,\"\",SUM(IF((INDEX(base_index,1,)=C$13)*(INDEX(base_index,,1)=$A23),INDEX(base_index,,),0)))","v":114.5},{"$f":"IF($A23>date2,\"\",SUM(IF((INDEX(base_indices,1,)=D$13)*(INDEX(base_indices,,1)=$A23),INDEX(base_indices,,),0)))","v":105},{"$f":"IF($A23>date2,\"\",SUM(IF((INDEX(base_indices,1,)=E$13)*(INDEX(base_indices,,1)=$A23),INDEX(base_indices,,),0)))","v":122.9},{"$f":"IF($A23>date2,\"\",SUM(IF((INDEX(base_indices,1,)=F$13)*(INDEX(base_indices,,1)=$A23),INDEX(base_indices,,),0)))","v":121.5},{"$f":"IF($A23>date2,\"\",SUM(IF((INDEX(base_indices,1,)=G$13)*(INDEX(base_indices,,1)=$A23),INDEX(base_indices,,),0)))","v":105.4},{"$f":"IF($A23>date2,\"\",SUM(IF((INDEX(base_indices,1,)=H$13)*(INDEX(base_indices,,1)=$A23),INDEX(base_indices,,),0)))","v":120.5},null,{"$f":"OFFSET('Composition index'!$J$2,0,R23)","v":"Matières plastiques sous formes primaires"},{"$f":"SUM(IF((INDEX(compo,2,)='Données dates variables'!J23)*(INDEX(compo,,1)=$J$1),INDEX(compo,,),0))","v":0},"Matières plastiques sous formes primaires",0,{"$f":"HLOOKUP(L23,'Composition index'!$A$2:$AR$3,2,FALSE)","v":"010534606"},{"$f":"SUM(IF((INDEX(base_indices,1,)=N23)*(INDEX(base_indices,,1)=date2),INDEX(base_indices,,),0))/SUM(IF((INDEX(base_indices,1,)=N23)*(INDEX(base_indices,,1)=date1),INDEX(base_indices,,),0))-1","v":0.30000000000000004},null,null,20]
["2019-08-01",{"$f":"IF(A24>date2,\"\",SUM(IF((INDEX(base_index,1,)=B$13)*(INDEX(base_index,,1)=$A24),INDEX(base_index,,),0)))","v":111.5},{"$f":"IF(A24>date2,\"\",SUM(IF((INDEX(base_index,1,)=C$13)*(INDEX(base_index,,1)=$A24),INDEX(base_index,,),0)))","v":114.7},{"$f":"IF($A24>date2,\"\",SUM(IF((INDEX(base_indices,1,)=D$13)*(INDEX(base_indices,,1)=$A24),INDEX(base_indices,,),0)))","v":105.1},{"$f":"IF($A24>date2,\"\",SUM(IF((INDEX(base_indices,1,)=E$13)*(INDEX(base_indices,,1)=$A24),INDEX(base_indices,,),0)))","v":123.1},{"$f":"IF($A24>date2,\"\",SUM(IF((INDEX(base_indices,1,)=F$13)*(INDEX(base_indices,,1)=$A24),INDEX(base_indices,,),0)))","v":119.9},{"$f":"IF($A24>date2,\"\",SUM(IF((INDEX(base_indices,1,)=G$13)*(INDEX(base_indices,,1)=$A24),INDEX(base_indices,,),0)))","v":106.7},{"$f":"IF($A24>date2,\"\",SUM(IF((INDEX(base_indices,1,)=H$13)*(INDEX(base_indices,,1)=$A24),INDEX(base_indices,,),0)))","v":119.8},null,{"$f":"OFFSET('Composition index'!$J$2,0,R24)","v":"Tubes, tuyaux, profilés creux et accessoires correspondants en acier"},{"$f":"SUM(IF((INDEX(compo,2,)='Données dates variables'!J24)*(INDEX(compo,,1)=$J$1),INDEX(compo,,),0))","v":0},"Tubes, tuyaux, profilés creux et accessoires correspondants en acier",0,{"$f":"HLOOKUP(L24,'Composition index'!$A$2:$AR$3,2,FALSE)","v":"010534654"},{"$f":"SUM(IF((INDEX(base_indices,1,)=N24)*(INDEX(base_indices,,1)=date2),INDEX(base_indices,,),0))/SUM(IF((INDEX(base_indices,1,)=N24)*(INDEX(base_indices,,1)=date1),INDEX(base_indices,,),0))-1","v":0.10540788267644374},null,null,21]
["2019-09-01",{"$f":"IF(A25>date2,\"\",SUM(IF((INDEX(base_index,1,)=B$13)*(INDEX(base_index,,1)=$A25),INDEX(base_index,,),0)))","v":111.2},{"$f":"IF(A25>date2,\"\",SUM(IF((INDEX(base_index,1,)=C$13)*(INDEX(base_index,,1)=$A25),INDEX(base_index,,),0)))","v":114.6},{"$f":"IF($A25>date2,\"\",SUM(IF((INDEX(base_indices,1,)=D$13)*(INDEX(base_indices,,1)=$A25),INDEX(base_indices,,),0)))","v":105.7},{"$f":"IF($A25>date2,\"\",SUM(IF((INDEX(base_indices,1,)=E$13)*(INDEX(base_indices,,1)=$A25),INDEX(base_indices,,),0)))","v":123.3},{"$f":"IF($A25>date2,\"\",SUM(IF((INDEX(base_indices,1,)=F$13)*(INDEX(base_indices,,1)=$A25),INDEX(base_indices,,),0)))","v":123.3},{"$f":"IF($A25>date2,\"\",SUM(IF((INDEX(base_indices,1,)=G$13)*(INDEX(base_indices,,1)=$A25),INDEX(base_indices,,),0)))","v":105.2},{"$f":"IF($A25>date2,\"\",SUM(IF((INDEX(base_indices,1,)=H$13)*(INDEX(base_indices,,1)=$A25),INDEX(base_indices,,),0)))","v":118.3},null,{"$f":"OFFSET('Composition index'!$J$2,0,R25)","v":"Éléments en béton pour la construction"},{"$f":"SUM(IF((INDEX(compo,2,)='Données dates variables'!J25)*(INDEX(compo,,1)=$J$1),INDEX(compo,,),0))","v":0},"Éléments en béton pour la construction",0,{"$f":"HLOOKUP(L25,'Composition index'!$A$2:$AR$3,2,FALSE)","v":"010534645"},{"$f":"SUM(IF((INDEX(base_indices,1,)=N25)*(INDEX(base_indices,,1)=date2),INDEX(base_indices,,),0))/SUM(IF((INDEX(base_indices,1,)=N25)*(INDEX(base_indices,,1)=date1),INDEX(base_indices,,),0))-1","v":8.0366225839267669E-2},null,null,22]
["2019-10-01",{"$f":"IF(A26>date2,\"\",SUM(IF((INDEX(base_index,1,)=B$13)*(INDEX(base_index,,1)=$A26),INDEX(base_index,,),0)))","v":111.2},{"$f":"IF(A26>date2,\"\",SUM(IF((INDEX(base_index,1,)=C$13)*(INDEX(base_index,,1)=$A26),INDEX(base_index,,),0)))","v":114.2},{"$f":"IF($A26>date2,\"\",SUM(IF((INDEX(base_indices,1,)=D$13)*(INDEX(base_indices,,1)=$A26),INDEX(base_indices,,),0)))","v":105.6},{"$f":"IF($A26>date2,\"\",SUM(IF((INDEX(base_indices,1,)=E$13)*(INDEX(base_indices,,1)=$A26),INDEX(base_indices,,),0)))","v":123.5},{"$f":"IF($A26>date2,\"\",SUM(IF((INDEX(base_indices,1,)=F$13)*(INDEX(base_indices,,1)=$A26),INDEX(base_indices,,),0)))","v":122.4},{"$f":"IF($A26>date2,\"\",SUM(IF((INDEX(base_indices,1,)=G$13)*(INDEX(base_indices,,1)=$A26),INDEX(base_indices,,),0)))","v":104.7},{"$f":"IF($A26>date2,\"\",SUM(IF((INDEX(base_indices,1,)=H$13)*(INDEX(base_indices,,1)=$A26),INDEX(base_indices,,),0)))","v":114.1},null,{"$f":"OFFSET('Composition index'!$J$2,0,R26)","v":"Fils et câbles d'énergie"},{"$f":"SUM(IF((INDEX(compo,2,)='Données dates variables'!J26)*(INDEX(compo,,1)=$J$1),INDEX(compo,,),0))","v":0},"Fils et câbles d'énergie",0,{"$f":"HLOOKUP(L26,'Composition index'!$A$2:$AR$3,2,FALSE)","v":"010534330"},{"$f":"SUM(IF((INDEX(base_indices,1,)=N26)*(INDEX(base_indices,,1)=date2),INDEX(base_indices,,),0))/SUM(IF((INDEX(base_indices,1,)=N26)*(INDEX(base_indices,,1)=date1),INDEX(base_indices,,),0))-1","v":0.27703398558187442},null,null,23]
["2019-11-01",{"$f":"IF(A27>date2,\"\",SUM(IF((INDEX(base_index,1,)=B$13)*(INDEX(base_index,,1)=$A27),INDEX(base_index,,),0)))","v":110.5},{"$f":"IF(A27>date2,\"\",SUM(IF((INDEX(base_index,1,)=C$13)*(INDEX(base_index,,1)=$A27),INDEX(base_index,,),0)))","v":114.2},{"$f":"IF($A27>date2,\"\",SUM(IF((INDEX(base_indices,1,)=D$13)*(INDEX(base_indices,,1)=$A27),INDEX(base_indices,,),0)))","v":105.1},{"$f":"IF($A27>date2,\"\",SUM(IF((INDEX(base_indices,1,)=E$13)*(INDEX(base_indices,,1)=$A27),INDEX(base_indices,,),0)))","v":123.7},{"$f":"IF($A27>date2,\"\",SUM(IF((INDEX(base_indices,1,)=F$13)*(INDEX(base_indices,,1)=$A27),INDEX(base_indices,,),0)))","v":122.5},{"$f":"IF($A27>date2,\"\",SUM(IF((INDEX(base_indices,1,)=G$13)*(INDEX(base_indices,,1)=$A27),INDEX(base_indices,,),0)))","v":104.5},{"$f":"IF($A27>date2,\"\",SUM(IF((INDEX(base_indices,1,)=H$13)*(INDEX(base_indices,,1)=$A27),INDEX(base_indices,,),0)))","v":111.3},null,{"$f":"OFFSET('Composition index'!$J$2,0,R27)","v":"Moteurs, génératrices, transfo. électr., matér. distrib., cmde électr."},{"$f":"SUM(IF((INDEX(compo,2,)='Données dates variables'!J27)*(INDEX(compo,,1)=$J$1),INDEX(compo,,),0))","v":0},"Moteurs, génératrices, transfo. électr., matér. distrib., cmde électr.",0,{"$f":"HLOOKUP(L27,'Composition index'!$A$2:$AR$3,2,FALSE)","v":"010534696"},{"$f":"SUM(IF((INDEX(base_indices,1,)=N27)*(INDEX(base_indices,,1)=date2),INDEX(base_indices,,),0))/SUM(IF((INDEX(base_indices,1,)=N27)*(INDEX(base_indices,,1)=date1),INDEX(base_indices,,),0))-1","v":5.9464816650148578E-2},null,null,24]
["2019-12-01",{"$f":"IF(A28>date2,\"\",SUM(IF((INDEX(base_index,1,)=B$13)*(INDEX(base_index,,1)=$A28),INDEX(base_index,,),0)))","v":110.4},{"$f":"IF(A28>date2,\"\",SUM(IF((INDEX(base_index,1,)=C$13)*(INDEX(base_index,,1)=$A28),INDEX(base_index,,),0)))","v":114.3},{"$f":"IF($A28>date2,\"\",SUM(IF((INDEX(base_indices,1,)=D$13)*(INDEX(base_indices,,1)=$A28),INDEX(base_indices,,),0)))","v":104.6},{"$f":"IF($A28>date2,\"\",SUM(IF((INDEX(base_indices,1,)=E$13)*(INDEX(base_indices,,1)=$A28),INDEX(base_indices,,),0)))","v":123.9},{"$f":"IF($A28>date2,\"\",SUM(IF((INDEX(base_indices,1,)=F$13)*(INDEX(base_indices,,1)=$A28),INDEX(base_indices,,),0)))","v":124.1},{"$f":"IF($A28>date2,\"\",SUM(IF((INDEX(base_indices,1,)=G$13)*(INDEX(base_indices,,1)=$A28),INDEX(base_indices,,),0)))","v":104.8},{"$f":"IF($A28>date2,\"\",SUM(IF((INDEX(base_indices,1,)=H$13)*(INDEX(base_indices,,1)=$A28),INDEX(base_indices,,),0)))","v":111.2},null,{"$f":"OFFSET('Composition index'!$J$2,0,R28)","v":"Matériel de distribution et de commande électrique"},{"$f":"SUM(IF((INDEX(compo,2,)='Données dates variables'!J28)*(INDEX(compo,,1)=$J$1),INDEX(compo,,),0))","v":0},"Matériel de distribution et de commande électrique",0,{"$f":"HLOOKUP(L28,'Composition index'!$A$2:$AR$3,2,FALSE)","v":"010534698"},{"$f":"SUM(IF((INDEX(base_indices,1,)=N28)*(INDEX(base_indices,,1)=date2),INDEX(base_indices,,),0))/SUM(IF((INDEX(base_indices,1,)=N28)*(INDEX(base_indices,,1)=date1),INDEX(base_indices,,),0))-1","v":7.9476861167001811E-2},null,null,25]
["2020-01-01",{"$f":"IF(A29>date2,\"\",SUM(IF((INDEX(base_index,1,)=B$13)*(INDEX(base_index,,1)=$A29),INDEX(base_index,,),0)))","v":111.4},{"$f":"IF(A29>date2,\"\",SUM(IF((INDEX(base_index,1,)=C$13)*(INDEX(base_index,,1)=$A29),INDEX(base_index,,),0)))","v":114.7},{"$f":"IF($A29>date2,\"\",SUM(IF((INDEX(base_indices,1,)=D$13)*(INDEX(base_indices,,1)=$A29),INDEX(base_indices,,),0)))","v":104.7},{"$f":"IF($A29>date2,\"\",SUM(IF((INDEX(base_indices,1,)=E$13)*(INDEX(base_indices,,1)=$A29),INDEX(base_indices,,),0)))","v":123.7},{"$f":"IF($A29>date2,\"\",SUM(IF((INDEX(base_indices,1,)=F$13)*(INDEX(base_indices,,1)=$A29),INDEX(base_indices,,),0)))","v":120.9},{"$f":"IF($A29>date2,\"\",SUM(IF((INDEX(base_indices,1,)=G$13)*(INDEX(base_indices,,1)=$A29),INDEX(base_indices,,),0)))","v":105.2},{"$f":"IF($A29>date2,\"\",SUM(IF((INDEX(base_indices,1,)=H$13)*(INDEX(base_indices,,1)=$A29),INDEX(base_indices,,),0)))","v":112.6},null,{"$f":"OFFSET('Composition index'!$J$2,0,R29)","v":"Appareils d'éclairage électrique"},{"$f":"SUM(IF((INDEX(compo,2,)='Données dates variables'!J29)*(INDEX(compo,,1)=$J$1),INDEX(compo,,),0))","v":0},"Appareils d'éclairage électrique",0,{"$f":"HLOOKUP(L29,'Composition index'!$A$2:$AR$3,2,FALSE)","v":"010534702"},{"$f":"SUM(IF((INDEX(base_indices,1,)=N29)*(INDEX(base_indices,,1)=date2),INDEX(base_indices,,),0))/SUM(IF((INDEX(base_indices,1,)=N29)*(INDEX(base_indices,,1)=date1),INDEX(base_indices,,),0))-1","v":-4.1067761806982128E-3},null,null,26]
["2020-02-01",{"$f":"IF(A30>date2,\"\",SUM(IF((INDEX(base_index,1,)=B$13)*(INDEX(base_index,,1)=$A30),INDEX(base_index,,),0)))","v":111.7},{"$f":"IF(A30>date2,\"\",SUM(IF((INDEX(base_index,1,)=C$13)*(INDEX(base_index,,1)=$A30),INDEX(base_index,,),0)))","v":114.8},{"$f":"IF($A30>date2,\"\",SUM(IF((INDEX(base_indices,1,)=D$13)*(INDEX(base_indices,,1)=$A30),INDEX(base_indices,,),0)))","v":105.5},{"$f":"IF($A30>date2,\"\",SUM(IF((INDEX(base_indices,1,)=E$13)*(INDEX(base_indices,,1)=$A30),INDEX(base_indices,,),0)))","v":123.5},{"$f":"IF($A30>date2,\"\",SUM(IF((INDEX(base_indices,1,)=F$13)*(INDEX(base_indices,,1)=$A30),INDEX(base_indices,,),0)))","v":115.3},{"$f":"IF($A30>date2,\"\",SUM(IF((INDEX(base_indices,1,)=G$13)*(INDEX(base_indices,,1)=$A30),INDEX(base_indices,,),0)))","v":103.7},{"$f":"IF($A30>date2,\"\",SUM(IF((INDEX(base_indices,1,)=H$13)*(INDEX(base_indices,,1)=$A30),INDEX(base_indices,,),0)))","v":113.5},null,{"$f":"OFFSET('Composition index'!$J$2,0,R30)","v":"Câbles de fibres optiques"},{"$f":"SUM(IF((INDEX(compo,2,)='Données dates variables'!J30)*(INDEX(compo,,1)=$J$1),INDEX(compo,,),0))","v":0},"Câbles de fibres optiques",0,{"$f":"HLOOKUP(L30,'Composition index'!$A$2:$AR$3,2,FALSE)","v":"010535345"},{"$f":"SUM(IF((INDEX(base_indices,1,)=N30)*(INDEX(base_indices,,1)=date2),INDEX(base_indices,,),0))/SUM(IF((INDEX(base_indices,1,)=N30)*(INDEX(base_indices,,1)=date1),INDEX(base_indices,,),0))-1","v":-6.7827681026580988E-2},null,null,27]
["2020-03-01",{"$f":"IF(A31>date2,\"\",SUM(IF((INDEX(base_index,1,)=B$13)*(INDEX(base_index,,1)=$A31),INDEX(base_index,,),0)))","v":110.8},{"$f":"IF(A31>date2,\"\",SUM(IF((INDEX(base_index,1,)=C$13)*(INDEX(base_index,,1)=$A31),INDEX(base_index,,),0)))","v":114.7},{"$f":"IF($A31>date2,\"\",SUM(IF((INDEX(base_indices,1,)=D$13)*(INDEX(base_indices,,1)=$A31),INDEX(base_indices,,),0)))","v":105.3},{"$f":"IF($A31>date2,\"\",SUM(IF((INDEX(base_indices,1,)=E$13)*(INDEX(base_indices,,1)=$A31),INDEX(base_indices,,),0)))","v":123.3},{"$f":"IF($A31>date2,\"\",SUM(IF((INDEX(base_indices,1,)=F$13)*(INDEX(base_indices,,1)=$A31),INDEX(base_indices,,),0)))","v":99.2},{"$f":"IF($A31>date2,\"\",SUM(IF((INDEX(base_indices,1,)=G$13)*(INDEX(base_indices,,1)=$A31),INDEX(base_indices,,),0)))","v":103.5},{"$f":"IF($A31>date2,\"\",SUM(IF((INDEX(base_indices,1,)=H$13)*(INDEX(base_indices,,1)=$A31),INDEX(base_indices,,),0)))","v":112.3},null,{"$f":"OFFSET('Composition index'!$J$2,0,R31)","v":"Peintures Industries"},{"$f":"SUM(IF((INDEX(compo,2,)='Données dates variables'!J31)*(INDEX(compo,,1)=$J$1),INDEX(compo,,),0))","v":0},"Peintures Industries",0,{"$f":"HLOOKUP(L31,'Composition index'!$A$2:$AR$3,2,FALSE)","v":"010534180"},{"$f":"SUM(IF((INDEX(base_indices,1,)=N31)*(INDEX(base_indices,,1)=date2),INDEX(base_indices,,),0))/SUM(IF((INDEX(base_indices,1,)=N31)*(INDEX(base_indices,,1)=date1),INDEX(base_indices,,),0))-1","v":0.136150234741784},null,null,28]
["2020-04-01",{"$f":"IF(A32>date2,\"\",SUM(IF((INDEX(base_index,1,)=B$13)*(INDEX(base_index,,1)=$A32),INDEX(base_index,,),0)))","v":108.9},{"$f":"IF(A32>date2,\"\",SUM(IF((INDEX(base_index,1,)=C$13)*(INDEX(base_index,,1)=$A32),INDEX(base_index,,),0)))","v":114.4},{"$f":"IF($A32>date2,\"\",SUM(IF((INDEX(base_indices,1,)=D$13)*(INDEX(base_indices,,1)=$A32),INDEX(base_indices,,),0)))","v":105.5},{"$f":"IF($A32>date2,\"\",SUM(IF((INDEX(base_indices,1,)=E$13)*(INDEX(base_indices,,1)=$A32),INDEX(base_indices,,),0)))","v":123.6},{"$f":"IF($A32>date2,\"\",SUM(IF((INDEX(base_indices,1,)=F$13)*(INDEX(base_indices,,1)=$A32),INDEX(base_indices,,),0)))","v":88.2},{"$f":"IF($A32>date2,\"\",SUM(IF((INDEX(base_indices,1,)=G$13)*(INDEX(base_indices,,1)=$A32),INDEX(base_indices,,),0)))","v":102.7},{"$f":"IF($A32>date2,\"\",SUM(IF((INDEX(base_indices,1,)=H$13)*(INDEX(base_indices,,1)=$A32),INDEX(base_indices,,),0)))","v":112.1},null,{"$f":"OFFSET('Composition index'!$J$2,0,R32)","v":"Produits sidérurgiques en acier non allié"},{"$f":"SUM(IF((INDEX(compo,2,)='Données dates variables'!J32)*(INDEX(compo,,1)=$J$1),INDEX(compo,,),0))","v":0},"Produits sidérurgiques en acier non allié",0,{"$f":"HLOOKUP(L32,'Composition index'!$A$2:$AR$3,2,FALSE)","v":"010534267"},{"$f":"SUM(IF((INDEX(base_indices,1,)=N32)*(INDEX(base_indices,,1)=date2),INDEX(base_indices,,),0))/SUM(IF((INDEX(base_indices,1,)=N32)*(INDEX(base_indices,,1)=date1),INDEX(base_indices,,),0))-1","v":0.28583617747440271},null,null,29]
["2020-05-01",{"$f":"IF(A33>date2,\"\",SUM(IF((INDEX(base_index,1,)=B$13)*(INDEX(base_index,,1)=$A33),INDEX(base_index,,),0)))","v":108.7},{"$f":"IF(A33>date2,\"\",SUM(IF((INDEX(base_index,1,)=C$13)*(INDEX(base_index,,1)=$A33),INDEX(base_index,,),0)))","v":114.2},{"$f":"IF($A33>date2,\"\",SUM(IF((INDEX(base_indices,1,)=D$13)*(INDEX(base_indices,,1)=$A33),INDEX(base_indices,,),0)))","v":104.9},{"$f":"IF($A33>date2,\"\",SUM(IF((INDEX(base_indices,1,)=E$13)*(INDEX(base_indices,,1)=$A33),INDEX(base_indices,,),0)))","v":123.8},{"$f":"IF($A33>date2,\"\",SUM(IF((INDEX(base_indices,1,)=F$13)*(INDEX(base_indices,,1)=$A33),INDEX(base_indices,,),0)))","v":91.2},{"$f":"IF($A33>date2,\"\",SUM(IF((INDEX(base_indices,1,)=G$13)*(INDEX(base_indices,,1)=$A33),INDEX(base_indices,,),0)))","v":104.4},{"$f":"IF($A33>date2,\"\",SUM(IF((INDEX(base_indices,1,)=H$13)*(INDEX(base_indices,,1)=$A33),INDEX(base_indices,,),0)))","v":111.3},null,{"$f":"OFFSET('Composition index'!$J$2,0,R33)","v":"Tôles quarto en aciers non alliés"},{"$f":"SUM(IF((INDEX(compo,2,)='Données dates variables'!J33)*(INDEX(compo,,1)=$J$1),INDEX(compo,,),0))","v":0},"Tôles quarto en aciers non alliés",0,{"$f":"HLOOKUP(L33,'Composition index'!$A$2:$AR$3,2,FALSE)","v":"010536480"},{"$f":"SUM(IF((INDEX(base_indices,1,)=N33)*(INDEX(base_indices,,1)=date2),INDEX(base_indices,,),0))/SUM(IF((INDEX(base_indices,1,)=N33)*(INDEX(base_indices,,1)=date1),INDEX(base_indices,,),0))-1","v":0.7756653992395437},null,null,30]
["2020-06-01",{"$f":"IF(A34>date2,\"\",SUM(IF((INDEX(base_index,1,)=B$13)*(INDEX(base_index,,1)=$A34),INDEX(base_index,,),0)))","v":108.8},{"$f":"IF(A34>date2,\"\",SUM(IF((INDEX(base_index,1,)=C$13)*(INDEX(base_index,,1)=$A34),INDEX(base_index,,),0)))","v":113.7},{"$f":"IF($A34>date2,\"\",SUM(IF((INDEX(base_indices,1,)=D$13)*(INDEX(base_indices,,1)=$A34),INDEX(base_indices,,),0)))","v":103},{"$f":"IF($A34>date2,\"\",SUM(IF((INDEX(base_indices,1,)=E$13)*(INDEX(base_indices,,1)=$A34),INDEX(base_indices,,),0)))","v":124},{"$f":"IF($A34>date2,\"\",SUM(IF((INDEX(base_indices,1,)=F$13)*(INDEX(base_indices,,1)=$A34),INDEX(base_indices,,),0)))","v":97.2},{"$f":"IF($A34>date2,\"\",SUM(IF((INDEX(base_indices,1,)=G$13)*(INDEX(base_indices,,1)=$A34),INDEX(base_indices,,),0)))","v":105.4},{"$f":"IF($A34>date2,\"\",SUM(IF((INDEX(base_indices,1,)=H$13)*(INDEX(base_indices,,1)=$A34),INDEX(base_indices,,),0)))","v":109.7},null,{"$f":"OFFSET('Composition index'!$J$2,0,R34)","v":"Éléments en métal pour la construction"},{"$f":"SUM(IF((INDEX(compo,2,)='Données dates variables'!J34)*(INDEX(compo,,1)=$J$1),INDEX(compo,,),0))","v":0},"Éléments en métal pour la construction",0,{"$f":"HLOOKUP(L34,'Composition index'!$A$2:$AR$3,2,FALSE)","v":"010534667"},{"$f":"SUM(IF((INDEX(base_indices,1,)=N34)*(INDEX(base_indices,,1)=date2),INDEX(base_indices,,),0))/SUM(IF((INDEX(base_indices,1,)=N34)*(INDEX(base_indices,,1)=date1),INDEX(base_indices,,),0))-1","v":0.17794970986460346},null,null,31]
["2020-07-01",{"$f":"IF(A35>date2,\"\",SUM(IF((INDEX(base_index,1,)=B$13)*(INDEX(base_index,,1)=$A35),INDEX(base_index,,),0)))","v":109.9},{"$f":"IF(A35>date2,\"\",SUM(IF((INDEX(base_index,1,)=C$13)*(INDEX(base_index,,1)=$A35),INDEX(base_index,,),0)))","v":113.7},{"$f":"IF($A35>date2,\"\",SUM(IF((INDEX(base_indices,1,)=D$13)*(INDEX(base_indices,,1)=$A35),INDEX(base_indices,,),0)))","v":102.6},{"$f":"IF($A35>date2,\"\",SUM(IF((INDEX(base_indices,1,)=E$13)*(INDEX(base_indices,,1)=$A35),INDEX(base_indices,,),0)))","v":123.8},{"$f":"IF($A35>date2,\"\",SUM(IF((INDEX(base_indices,1,)=F$13)*(INDEX(base_indices,,1)=$A35),INDEX(base_indices,,),0)))","v":99.7},{"$f":"IF($A35>date2,\"\",SUM(IF((INDEX(base_indices,1,)=G$13)*(INDEX(base_indices,,1)=$A35),INDEX(base_indices,,),0)))","v":105.6},{"$f":"IF($A35>date2,\"\",SUM(IF((INDEX(base_indices,1,)=H$13)*(INDEX(base_indices,,1)=$A35),INDEX(base_indices,,),0)))","v":108},null,{"$f":"OFFSET('Composition index'!$J$2,0,R35)","v":"Restaurants et hôtels"},{"$f":"SUM(IF((INDEX(compo,2,)='Données dates variables'!J35)*(INDEX(compo,,1)=$J$1),INDEX(compo,,),0))","v":0},"Restaurants et hôtels",0,{"$f":"HLOOKUP(L35,'Composition index'!$A$2:$AR$3,2,FALSE)","v":"001763781"},{"$f":"SUM(IF((INDEX(base_indices,1,)=N35)*(INDEX(base_indices,,1)=date2),INDEX(base_indices,,),0))/SUM(IF((INDEX(base_indices,1,)=N35)*(INDEX(base_indices,,1)=date1),INDEX(base_indices,,),0))-1","v":3.5375569044006072E-2},null,null,32]
["2020-08-01",{"$f":"IF(A36>date2,\"\",SUM(IF((INDEX(base_index,1,)=B$13)*(INDEX(base_index,,1)=$A36),INDEX(base_index,,),0)))","v":110},{"$f":"IF(A36>date2,\"\",SUM(IF((INDEX(base_index,1,)=C$13)*(INDEX(base_index,,1)=$A36),INDEX(base_index,,),0)))","v":113.8},{"$f":"IF($A36>date2,\"\",SUM(IF((INDEX(base_indices,1,)=D$13)*(INDEX(base_indices,,1)=$A36),INDEX(base_indices,,),0)))","v":102.8},{"$f":"IF($A36>date2,\"\",SUM(IF((INDEX(base_indices,1,)=E$13)*(INDEX(base_indices,,1)=$A36),INDEX(base_indices,,),0)))","v":123.7},{"$f":"IF($A36>date2,\"\",SUM(IF((INDEX(base_indices,1,)=F$13)*(INDEX(base_indices,,1)=$A36),INDEX(base_indices,,),0)))","v":98.3},{"$f":"IF($A36>date2,\"\",SUM(IF((INDEX(base_indices,1,)=G$13)*(INDEX(base_indices,,1)=$A36),INDEX(base_indices,,),0)))","v":105.4},{"$f":"IF($A36>date2,\"\",SUM(IF((INDEX(base_indices,1,)=H$13)*(INDEX(base_indices,,1)=$A36),INDEX(base_indices,,),0)))","v":107.4},null,{"$f":"OFFSET('Composition index'!$J$2,0,R36)","v":"Traitement et élimination des déchets non dangereux"},{"$f":"SUM(IF((INDEX(compo,2,)='Données dates variables'!J36)*(INDEX(compo,,1)=$J$1),INDEX(compo,,),0))","v":0},"Traitement et élimination des déchets non dangereux",0,{"$f":"HLOOKUP(L36,'Composition index'!$A$2:$AR$3,2,FALSE)","v":"010534789"},{"$f":"SUM(IF((INDEX(base_indices,1,)=N36)*(INDEX(base_indices,,1)=date2),INDEX(base_indices,,),0))/SUM(IF((INDEX(base_indices,1,)=N36)*(INDEX(base_indices,,1)=date1),INDEX(base_indices,,),0))-1","v":0.10457516339869288},null,null,33]
["2020-09-01",{"$f":"IF(A37>date2,\"\",SUM(IF((INDEX(base_index,1,)=B$13)*(INDEX(base_index,,1)=$A37),INDEX(base_index,,),0)))","v":110.1},{"$f":"IF(A37>date2,\"\",SUM(IF((INDEX(base_index,1,)=C$13)*(INDEX(base_index,,1)=$A37),INDEX(base_index,,),0)))","v":114.4},{"$f":"IF($A37>date2,\"\",SUM(IF((INDEX(base_indices,1,)=D$13)*(INDEX(base_indices,,1)=$A37),INDEX(base_indices,,),0)))","v":104.4},{"$f":"IF($A37>date2,\"\",SUM(IF((INDEX(base_indices,1,)=E$13)*(INDEX(base_indices,,1)=$A37),INDEX(base_indices,,),0)))","v":123.6},{"$f":"IF($A37>date2,\"\",SUM(IF((INDEX(base_indices,1,)=F$13)*(INDEX(base_indices,,1)=$A37),INDEX(base_indices,,),0)))","v":94.9},{"$f":"IF($A37>date2,\"\",SUM(IF((INDEX(base_indices,1,)=G$13)*(INDEX(base_indices,,1)=$A37),INDEX(base_indices,,),0)))","v":106.5},{"$f":"IF($A37>date2,\"\",SUM(IF((INDEX(base_indices,1,)=H$13)*(INDEX(base_indices,,1)=$A37),INDEX(base_indices,,),0)))","v":108.5},null,{"$f":"OFFSET('Composition index'!$J$2,0,R37)","v":"Collecte, traitement et élimination des déchets ; récupération de matériaux"},{"$f":"SUM(IF((INDEX(compo,2,)='Données dates variables'!J37)*(INDEX(compo,,1)=$J$1),INDEX(compo,,),0))","v":0},"Collecte, traitement et élimination des déchets ; récupération de matériaux",0,{"$f":"HLOOKUP(L37,'Composition index'!$A$2:$AR$3,2,FALSE)","v":"010534784"},{"$f":"SUM(IF((INDEX(base_indices,1,)=N37)*(INDEX(base_indices,,1)=date2),INDEX(base_indices,,),0))/SUM(IF((INDEX(base_indices,1,)=N37)*(INDEX(base_indices,,1)=date1),INDEX(base_indices,,),0))-1","v":0.10480769230769238},null,null,34]
["2020-10-01",{"$f":"IF(A38>date2,\"\",SUM(IF((INDEX(base_index,1,)=B$13)*(INDEX(base_index,,1)=$A38),INDEX(base_index,,),0)))","v":109.5},{"$f":"IF(A38>date2,\"\",SUM(IF((INDEX(base_index,1,)=C$13)*(INDEX(base_index,,1)=$A38),INDEX(base_index,,),0)))","v":114.4},{"$f":"IF($A38>date2,\"\",SUM(IF((INDEX(base_indices,1,)=D$13)*(INDEX(base_indices,,1)=$A38),INDEX(base_indices,,),0)))","v":104.1},{"$f":"IF($A38>date2,\"\",SUM(IF((INDEX(base_indices,1,)=E$13)*(INDEX(base_indices,,1)=$A38),INDEX(base_indices,,),0)))","v":123.5},{"$f":"IF($A38>date2,\"\",SUM(IF((INDEX(base_indices,1,)=F$13)*(INDEX(base_indices,,1)=$A38),INDEX(base_indices,,),0)))","v":95},{"$f":"IF($A38>date2,\"\",SUM(IF((INDEX(base_indices,1,)=G$13)*(INDEX(base_indices,,1)=$A38),INDEX(base_indices,,),0)))","v":105.9},{"$f":"IF($A38>date2,\"\",SUM(IF((INDEX(base_indices,1,)=H$13)*(INDEX(base_indices,,1)=$A38),INDEX(base_indices,,),0)))","v":110.7}]
["2020-11-01",{"$f":"IF(A39>date2,\"\",SUM(IF((INDEX(base_index,1,)=B$13)*(INDEX(base_index,,1)=$A39),INDEX(base_index,,),0)))","v":109.5},{"$f":"IF(A39>date2,\"\",SUM(IF((INDEX(base_index,1,)=C$13)*(INDEX(base_index,,1)=$A39),INDEX(base_index,,),0)))","v":114.5},{"$f":"IF($A39>date2,\"\",SUM(IF((INDEX(base_indices,1,)=D$13)*(INDEX(base_indices,,1)=$A39),INDEX(base_indices,,),0)))","v":104.4},{"$f":"IF($A39>date2,\"\",SUM(IF((INDEX(base_indices,1,)=E$13)*(INDEX(base_indices,,1)=$A39),INDEX(base_indices,,),0)))","v":123.5},{"$f":"IF($A39>date2,\"\",SUM(IF((INDEX(base_indices,1,)=F$13)*(INDEX(base_indices,,1)=$A39),INDEX(base_indices,,),0)))","v":96.6},{"$f":"IF($A39>date2,\"\",SUM(IF((INDEX(base_indices,1,)=G$13)*(INDEX(base_indices,,1)=$A39),INDEX(base_indices,,),0)))","v":105.4},{"$f":"IF($A39>date2,\"\",SUM(IF((INDEX(base_indices,1,)=H$13)*(INDEX(base_indices,,1)=$A39),INDEX(base_indices,,),0)))","v":112.6}]
["2020-12-01",{"$f":"IF(A40>date2,\"\",SUM(IF((INDEX(base_index,1,)=B$13)*(INDEX(base_index,,1)=$A40),INDEX(base_index,,),0)))","v":109.8},{"$f":"IF(A40>date2,\"\",SUM(IF((INDEX(base_index,1,)=C$13)*(INDEX(base_index,,1)=$A40),INDEX(base_index,,),0)))","v":114.9},{"$f":"IF($A40>date2,\"\",SUM(IF((INDEX(base_indices,1,)=D$13)*(INDEX(base_indices,,1)=$A40),INDEX(base_indices,,),0)))","v":104.4},{"$f":"IF($A40>date2,\"\",SUM(IF((INDEX(base_indices,1,)=E$13)*(INDEX(base_indices,,1)=$A40),INDEX(base_indices,,),0)))","v":123.4},{"$f":"IF($A40>date2,\"\",SUM(IF((INDEX(base_indices,1,)=F$13)*(INDEX(base_indices,,1)=$A40),INDEX(base_indices,,),0)))","v":101.2},{"$f":"IF($A40>date2,\"\",SUM(IF((INDEX(base_indices,1,)=G$13)*(INDEX(base_indices,,1)=$A40),INDEX(base_indices,,),0)))","v":104.7},{"$f":"IF($A40>date2,\"\",SUM(IF((INDEX(base_indices,1,)=H$13)*(INDEX(base_indices,,1)=$A40),INDEX(base_indices,,),0)))","v":116.1}]
["2021-01-01",{"$f":"IF(A41>date2,\"\",SUM(IF((INDEX(base_index,1,)=B$13)*(INDEX(base_index,,1)=$A41),INDEX(base_index,,),0)))","v":111.2},{"$f":"IF(A41>date2,\"\",SUM(IF((INDEX(base_index,1,)=C$13)*(INDEX(base_index,,1)=$A41),INDEX(base_index,,),0)))","v":116.3},{"$f":"IF($A41>date2,\"\",SUM(IF((INDEX(base_indices,1,)=D$13)*(INDEX(base_indices,,1)=$A41),INDEX(base_indices,,),0)))","v":104.5},{"$f":"IF($A41>date2,\"\",SUM(IF((INDEX(base_indices,1,)=E$13)*(INDEX(base_indices,,1)=$A41),INDEX(base_indices,,),0)))","v":123.4},{"$f":"IF($A41>date2,\"\",SUM(IF((INDEX(base_indices,1,)=F$13)*(INDEX(base_indices,,1)=$A41),INDEX(base_indices,,),0)))","v":104.6},{"$f":"IF($A41>date2,\"\",SUM(IF((INDEX(base_indices,1,)=G$13)*(INDEX(base_indices,,1)=$A41),INDEX(base_indices,,),0)))","v":105.8},{"$f":"IF($A41>date2,\"\",SUM(IF((INDEX(base_indices,1,)=H$13)*(INDEX(base_indices,,1)=$A41),INDEX(base_indices,,),0)))","v":130.80000000000001}]
["2021-02-01",{"$f":"IF(A42>date2,\"\",SUM(IF((INDEX(base_index,1,)=B$13)*(INDEX(base_index,,1)=$A42),INDEX(base_index,,),0)))","v":112.1},{"$f":"IF(A42>date2,\"\",SUM(IF((INDEX(base_index,1,)=C$13)*(INDEX(base_index,,1)=$A42),INDEX(base_index,,),0)))","v":117.2},{"$f":"IF($A42>date2,\"\",SUM(IF((INDEX(base_indices,1,)=D$13)*(INDEX(base_indices,,1)=$A42),INDEX(base_indices,,),0)))","v":104.5},{"$f":"IF($A42>date2,\"\",SUM(IF((INDEX(base_indices,1,)=E$13)*(INDEX(base_indices,,1)=$A42),INDEX(base_indices,,),0)))","v":123.3},{"$f":"IF($A42>date2,\"\",SUM(IF((INDEX(base_indices,1,)=F$13)*(INDEX(base_indices,,1)=$A42),INDEX(base_indices,,),0)))","v":109.6},{"$f":"IF($A42>date2,\"\",SUM(IF((INDEX(base_indices,1,)=G$13)*(INDEX(base_indices,,1)=$A42),INDEX(base_indices,,),0)))","v":105.9},{"$f":"IF($A42>date2,\"\",SUM(IF((INDEX(base_indices,1,)=H$13)*(INDEX(base_indices,,1)=$A42),INDEX(base_indices,,),0)))","v":139.19999999999999}]
["2021-03-01",{"$f":"IF(A43>date2,\"\",SUM(IF((INDEX(base_index,1,)=B$13)*(INDEX(base_index,,1)=$A43),INDEX(base_index,,),0)))","v":113.5},{"$f":"IF(A43>date2,\"\",SUM(IF((INDEX(base_index,1,)=C$13)*(INDEX(base_index,,1)=$A43),INDEX(base_index,,),0)))","v":118.3},{"$f":"IF($A43>date2,\"\",SUM(IF((INDEX(base_indices,1,)=D$13)*(INDEX(base_indices,,1)=$A43),INDEX(base_indices,,),0)))","v":107.6},{"$f":"IF($A43>date2,\"\",SUM(IF((INDEX(base_indices,1,)=E$13)*(INDEX(base_indices,,1)=$A43),INDEX(base_indices,,),0)))","v":123.3},{"$f":"IF($A43>date2,\"\",SUM(IF((INDEX(base_indices,1,)=F$13)*(INDEX(base_indices,,1)=$A43),INDEX(base_indices,,),0)))","v":111.5},{"$f":"IF($A43>date2,\"\",SUM(IF((INDEX(base_indices,1,)=G$13)*(INDEX(base_indices,,1)=$A43),INDEX(base_indices,,),0)))","v":106.2},{"$f":"IF($A43>date2,\"\",SUM(IF((INDEX(base_indices,1,)=H$13)*(INDEX(base_indices,,1)=$A43),INDEX(base_indices,,),0)))","v":144.6}]
["2021-04-01",{"$f":"IF(A44>date2,\"\",SUM(IF((INDEX(base_index,1,)=B$13)*(INDEX(base_index,,1)=$A44),INDEX(base_index,,),0)))","v":113.8},{"$f":"IF(A44>date2,\"\",SUM(IF((INDEX(base_index,1,)=C$13)*(INDEX(base_index,,1)=$A44),INDEX(base_index,,),0)))","v":118.9},{"$f":"IF($A44>date2,\"\",SUM(IF((INDEX(base_indices,1,)=D$13)*(INDEX(base_indices,,1)=$A44),INDEX(base_indices,,),0)))","v":107.8},{"$f":"IF($A44>date2,\"\",SUM(IF((INDEX(base_indices,1,)=E$13)*(INDEX(base_indices,,1)=$A44),INDEX(base_indices,,),0)))","v":123},{"$f":"IF($A44>date2,\"\",SUM(IF((INDEX(base_indices,1,)=F$13)*(INDEX(base_indices,,1)=$A44),INDEX(base_indices,,),0)))","v":110.9},{"$f":"IF($A44>date2,\"\",SUM(IF((INDEX(base_indices,1,)=G$13)*(INDEX(base_indices,,1)=$A44),INDEX(base_indices,,),0)))","v":106.4},{"$f":"IF($A44>date2,\"\",SUM(IF((INDEX(base_indices,1,)=H$13)*(INDEX(base_indices,,1)=$A44),INDEX(base_indices,,),0)))","v":149.4}]
["2021-05-01",{"$f":"IF(A45>date2,\"\",SUM(IF((INDEX(base_index,1,)=B$13)*(INDEX(base_index,,1)=$A45),INDEX(base_index,,),0)))","v":114},{"$f":"IF(A45>date2,\"\",SUM(IF((INDEX(base_index,1,)=C$13)*(INDEX(base_index,,1)=$A45),INDEX(base_index,,),0)))","v":119},{"$f":"IF($A45>date2,\"\",SUM(IF((INDEX(base_indices,1,)=D$13)*(INDEX(base_indices,,1)=$A45),INDEX(base_indices,,),0)))","v":107.2},{"$f":"IF($A45>date2,\"\",SUM(IF((INDEX(base_indices,1,)=E$13)*(INDEX(base_indices,,1)=$A45),INDEX(base_indices,,),0)))","v":122.7},{"$f":"IF($A45>date2,\"\",SUM(IF((INDEX(base_indices,1,)=F$13)*(INDEX(base_indices,,1)=$A45),INDEX(base_indices,,),0)))","v":112.9},{"$f":"IF($A45>date2,\"\",SUM(IF((INDEX(base_indices,1,)=G$13)*(INDEX(base_indices,,1)=$A45),INDEX(base_indices,,),0)))","v":106},{"$f":"IF($A45>date2,\"\",SUM(IF((INDEX(base_indices,1,)=H$13)*(INDEX(base_indices,,1)=$A45),INDEX(base_indices,,),0)))","v":153.5}]
["2021-06-01",{"$f":"IF(A46>date2,\"\",SUM(IF((INDEX(base_index,1,)=B$13)*(INDEX(base_index,,1)=$A46),INDEX(base_index,,),0)))","v":114.8},{"$f":"IF(A46>date2,\"\",SUM(IF((INDEX(base_index,1,)=C$13)*(INDEX(base_index,,1)=$A46),INDEX(base_index,,),0)))","v":120.8},{"$f":"IF($A46>date2,\"\",SUM(IF((INDEX(base_indices,1,)=D$13)*(INDEX(base_indices,,1)=$A46),INDEX(base_indices,,),0)))","v":107.8},{"$f":"IF($A46>date2,\"\",SUM(IF((INDEX(base_indices,1,)=E$13)*(INDEX(base_indices,,1)=$A46),INDEX(base_indices,,),0)))","v":122.5},{"$f":"IF($A46>date2,\"\",SUM(IF((INDEX(base_indices,1,)=F$13)*(INDEX(base_indices,,1)=$A46),INDEX(base_indices,,),0)))","v":117.1},{"$f":"IF($A46>date2,\"\",SUM(IF((INDEX(base_indices,1,)=G$13)*(INDEX(base_indices,,1)=$A46),INDEX(base_indices,,),0)))","v":105.6},{"$f":"IF($A46>date2,\"\",SUM(IF((INDEX(base_indices,1,)=H$13)*(INDEX(base_indices,,1)=$A46),INDEX(base_indices,,),0)))","v":167.7}]
[{"$f":"IF(A46=\"\",\"\",IF(EDATE(A46,1)>date2,\"\",EDATE(A46,1)))","v":"2021-07-01"},{"$f":"IF(A47>date2,\"\",SUM(IF((INDEX(base_index,1,)=B$13)*(INDEX(base_index,,1)=$A47),INDEX(base_index,,),0)))","v":115.9},{"$f":"IF(A47>date2,\"\",SUM(IF((INDEX(base_index,1,)=C$13)*(INDEX(base_index,,1)=$A47),INDEX(base_index,,),0)))","v":122.7},{"$f":"IF($A47>date2,\"\",SUM(IF((INDEX(base_indices,1,)=D$13)*(INDEX(base_indices,,1)=$A47),INDEX(base_indices,,),0)))","v":108.3},{"$f":"IF($A47>date2,\"\",SUM(IF((INDEX(base_indices,1,)=E$13)*(INDEX(base_indices,,1)=$A47),INDEX(base_indices,,),0)))","v":122.5},{"$f":"IF($A47>date2,\"\",SUM(IF((INDEX(base_indices,1,)=F$13)*(INDEX(base_indices,,1)=$A47),INDEX(base_indices,,),0)))","v":120.9},{"$f":"IF($A47>date2,\"\",SUM(IF((INDEX(base_indices,1,)=G$13)*(INDEX(base_indices,,1)=$A47),INDEX(base_indices,,),0)))","v":106.7},{"$f":"IF($A47>date2,\"\",SUM(IF((INDEX(base_indices,1,)=H$13)*(INDEX(base_indices,,1)=$A47),INDEX(base_indices,,),0)))","v":185.7}]
["2021-08-01",{"$f":"IF(A48>date2,\"\",SUM(IF((INDEX(base_index,1,)=B$13)*(INDEX(base_index,,1)=$A48),INDEX(base_index,,),0)))","v":116.1},{"$f":"IF(A48>date2,\"\",SUM(IF((INDEX(base_index,1,)=C$13)*(INDEX(base_index,,1)=$A48),INDEX(base_index,,),0)))","v":123.1},{"$f":"IF($A48>date2,\"\",SUM(IF((INDEX(base_indices,1,)=D$13)*(INDEX(base_indices,,1)=$A48),INDEX(base_indices,,),0)))","v":108.2},{"$f":"IF($A48>date2,\"\",SUM(IF((INDEX(base_indices,1,)=E$13)*(INDEX(base_indices,,1)=$A48),INDEX(base_indices,,),0)))","v":122.6},{"$f":"IF($A48>date2,\"\",SUM(IF((INDEX(base_indices,1,)=F$13)*(INDEX(base_indices,,1)=$A48),INDEX(base_indices,,),0)))","v":122.5},{"$f":"IF($A48>date2,\"\",SUM(IF((INDEX(base_indices,1,)=G$13)*(INDEX(base_indices,,1)=$A48),INDEX(base_indices,,),0)))","v":108.3},{"$f":"IF($A48>date2,\"\",SUM(IF((INDEX(base_indices,1,)=H$13)*(INDEX(base_indices,,1)=$A48),INDEX(base_indices,,),0)))","v":191.7}]
["2021-09-01",{"$f":"IF(A49>date2,\"\",SUM(IF((INDEX(base_index,1,)=B$13)*(INDEX(base_index,,1)=$A49),INDEX(base_index,,),0)))","v":116.4},{"$f":"IF(A49>date2,\"\",SUM(IF((INDEX(base_index,1,)=C$13)*(INDEX(base_index,,1)=$A49),INDEX(base_index,,),0)))","v":123.7},{"$f":"IF($A49>date2,\"\",SUM(IF((INDEX(base_indices,1,)=D$13)*(INDEX(base_indices,,1)=$A49),INDEX(base_indices,,),0)))","v":108.6},{"$f":"IF($A49>date2,\"\",SUM(IF((INDEX(base_indices,1,)=E$13)*(INDEX(base_indices,,1)=$A49),INDEX(base_indices,,),0)))","v":122.7},{"$f":"IF($A49>date2,\"\",SUM(IF((INDEX(base_indices,1,)=F$13)*(INDEX(base_indices,,1)=$A49),INDEX(base_indices,,),0)))","v":123.3},{"$f":"IF($A49>date2,\"\",SUM(IF((INDEX(base_indices,1,)=G$13)*(INDEX(base_indices,,1)=$A49),INDEX(base_indices,,),0)))","v":105.5},{"$f":"IF($A49>date2,\"\",SUM(IF((INDEX(base_indices,1,)=H$13)*(INDEX(base_indices,,1)=$A49),INDEX(base_indices,,),0)))","v":196.7}]
["2021-10-01",{"$f":"IF(A50>date2,\"\",SUM(IF((INDEX(base_index,1,)=B$13)*(INDEX(base_index,,1)=$A50),INDEX(base_index,,),0)))","v":117.5},{"$f":"IF(A50>date2,\"\",SUM(IF((INDEX(base_index,1,)=C$13)*(INDEX(base_index,,1)=$A50),INDEX(base_index,,),0)))","v":123.6},{"$f":"IF($A50>date2,\"\",SUM(IF((INDEX(base_indices,1,)=D$13)*(INDEX(base_indices,,1)=$A50),INDEX(base_indices,,),0)))","v":109},{"$f":"IF($A50>date2,\"\",SUM(IF((INDEX(base_indices,1,)=E$13)*(INDEX(base_indices,,1)=$A50),INDEX(base_indices,,),0)))","v":122.7},{"$f":"IF($A50>date2,\"\",SUM(IF((INDEX(base_indices,1,)=F$13)*(INDEX(base_indices,,1)=$A50),INDEX(base_indices,,),0)))","v":133},{"$f":"IF($A50>date2,\"\",SUM(IF((INDEX(base_indices,1,)=G$13)*(INDEX(base_indices,,1)=$A50),INDEX(base_indices,,),0)))","v":106.4},{"$f":"IF($A50>date2,\"\",SUM(IF((INDEX(base_indices,1,)=H$13)*(INDEX(base_indices,,1)=$A50),INDEX(base_indices,,),0)))","v":193}]
["",{"$f":"IF(A51>date2,\"\",SUM(IF((INDEX(base_index,1,)=B$13)*(INDEX(base_index,,1)=$A51),INDEX(base_index,,),0)))","v":""},{"$f":"IF(A51>date2,\"\",SUM(IF((INDEX(base_index,1,)=C$13)*(INDEX(base_index,,1)=$A51),INDEX(base_index,,),0)))","v":""},{"$f":"IF($A51>date2,\"\",SUM(IF((INDEX(base_indices,1,)=D$13)*(INDEX(base_indices,,1)=$A51),INDEX(base_indices,,),0)))","v":""},{"$f":"IF($A51>date2,\"\",SUM(IF((INDEX(base_indices,1,)=E$13)*(INDEX(base_indices,,1)=$A51),INDEX(base_indices,,),0)))","v":""},{"$f":"IF($A51>date2,\"\",SUM(IF((INDEX(base_indices,1,)=F$13)*(INDEX(base_indices,,1)=$A51),INDEX(base_indices,,),0)))","v":""},{"$f":"IF($A51>date2,\"\",SUM(IF((INDEX(base_indices,1,)=G$13)*(INDEX(base_indices,,1)=$A51),INDEX(base_indices,,),0)))","v":""},{"$f":"IF($A51>date2,\"\",SUM(IF((INDEX(base_indices,1,)=H$13)*(INDEX(base_indices,,1)=$A51),INDEX(base_indices,,),0)))","v":""}]
["",{"$f":"IF(A52>date2,\"\",SUM(IF((INDEX(base_index,1,)=B$13)*(INDEX(base_index,,1)=$A52),INDEX(base_index,,),0)))","v":""},{"$f":"IF(A52>date2,\"\",SUM(IF((INDEX(base_index,1,)=C$13)*(INDEX(base_index,,1)=$A52),INDEX(base_index,,),0)))","v":""},{"$f":"IF($A52>date2,\"\",SUM(IF((INDEX(base_indices,1,)=D$13)*(INDEX(base_indices,,1)=$A52),INDEX(base_indices,,),0)))","v":""},{"$f":"IF($A52>date2,\"\",SUM(IF((INDEX(base_indices,1,)=E$13)*(INDEX(base_indices,,1)=$A52),INDEX(base_indices,,),0)))","v":""},{"$f":"IF($A52>date2,\"\",SUM(IF((INDEX(base_indices,1,)=F$13)*(INDEX(base_indices,,1)=$A52),INDEX(base_indices,,),0)))","v":""},{"$f":"IF($A52>date2,\"\",SUM(IF((INDEX(base_indices,1,)=G$13)*(INDEX(base_indices,,1)=$A52),INDEX(base_indices,,),0)))","v":""},{"$f":"IF($A52>date2,\"\",SUM(IF((INDEX(base_indices,1,)=H$13)*(INDEX(base_indices,,1)=$A52),INDEX(base_indices,,),0)))","v":""}]
["",{"$f":"IF(A53>date2,\"\",SUM(IF((INDEX(base_index,1,)=B$13)*(INDEX(base_index,,1)=$A53),INDEX(base_index,,),0)))","v":""},{"$f":"IF(A53>date2,\"\",SUM(IF((INDEX(base_index,1,)=C$13)*(INDEX(base_index,,1)=$A53),INDEX(base_index,,),0)))","v":""},{"$f":"IF($A53>date2,\"\",SUM(IF((INDEX(base_indices,1,)=D$13)*(INDEX(base_indices,,1)=$A53),INDEX(base_indices,,),0)))","v":""},{"$f":"IF($A53>date2,\"\",SUM(IF((INDEX(base_indices,1,)=E$13)*(INDEX(base_indices,,1)=$A53),INDEX(base_indices,,),0)))","v":""},{"$f":"IF($A53>date2,\"\",SUM(IF((INDEX(base_indices,1,)=F$13)*(INDEX(base_indices,,1)=$A53),INDEX(base_indices,,),0)))","v":""},{"$f":"IF($A53>date2,\"\",SUM(IF((INDEX(base_indices,1,)=G$13)*(INDEX(base_indices,,1)=$A53),INDEX(base_indices,,),0)))","v":""},{"$f":"IF($A53>date2,\"\",SUM(IF((INDEX(base_indices,1,)=H$13)*(INDEX(base_indices,,1)=$A53),INDEX(base_indices,,),0)))","v":""}]
["",{"$f":"IF(A54>date2,\"\",SUM(IF((INDEX(base_index,1,)=B$13)*(INDEX(base_index,,1)=$A54),INDEX(base_index,,),0)))","v":""},{"$f":"IF(A54>date2,\"\",SUM(IF((INDEX(base_index,1,)=C$13)*(INDEX(base_index,,1)=$A54),INDEX(base_index,,),0)))","v":""},{"$f":"IF($A54>date2,\"\",SUM(IF((INDEX(base_indices,1,)=D$13)*(INDEX(base_indices,,1)=$A54),INDEX(base_indices,,),0)))","v":""},{"$f":"IF($A54>date2,\"\",SUM(IF((INDEX(base_indices,1,)=E$13)*(INDEX(base_indices,,1)=$A54),INDEX(base_indices,,),0)))","v":""},{"$f":"IF($A54>date2,\"\",SUM(IF((INDEX(base_indices,1,)=F$13)*(INDEX(base_indices,,1)=$A54),INDEX(base_indices,,),0)))","v":""},{"$f":"IF($A54>date2,\"\",SUM(IF((INDEX(base_indices,1,)=G$13)*(INDEX(base_indices,,1)=$A54),INDEX(base_indices,,),0)))","v":""},{"$f":"IF($A54>date2,\"\",SUM(IF((INDEX(base_indices,1,)=H$13)*(INDEX(base_indices,,1)=$A54),INDEX(base_indices,,),0)))","v":""}]
["",{"$f":"IF(A55>date2,\"\",SUM(IF((INDEX(base_index,1,)=B$13)*(INDEX(base_index,,1)=$A55),INDEX(base_index,,),0)))","v":""},{"$f":"IF(A55>date2,\"\",SUM(IF((INDEX(base_index,1,)=C$13)*(INDEX(base_index,,1)=$A55),INDEX(base_index,,),0)))","v":""},{"$f":"IF($A55>date2,\"\",SUM(IF((INDEX(base_indices,1,)=D$13)*(INDEX(base_indices,,1)=$A55),INDEX(base_indices,,),0)))","v":""},{"$f":"IF($A55>date2,\"\",SUM(IF((INDEX(base_indices,1,)=E$13)*(INDEX(base_indices,,1)=$A55),INDEX(base_indices,,),0)))","v":""},{"$f":"IF($A55>date2,\"\",SUM(IF((INDEX(base_indices,1,)=F$13)*(INDEX(base_indices,,1)=$A55),INDEX(base_indices,,),0)))","v":""},{"$f":"IF($A55>date2,\"\",SUM(IF((INDEX(base_indices,1,)=G$13)*(INDEX(base_indices,,1)=$A55),INDEX(base_indices,,),0)))","v":""},{"$f":"IF($A55>date2,\"\",SUM(IF((INDEX(base_indices,1,)=H$13)*(INDEX(base_indices,,1)=$A55),INDEX(base_indices,,),0)))","v":""}]
["",{"$f":"IF(A56>date2,\"\",SUM(IF((INDEX(base_index,1,)=B$13)*(INDEX(base_index,,1)=$A56),INDEX(base_index,,),0)))","v":""},{"$f":"IF(A56>date2,\"\",SUM(IF((INDEX(base_index,1,)=C$13)*(INDEX(base_index,,1)=$A56),INDEX(base_index,,),0)))","v":""},{"$f":"IF($A56>date2,\"\",SUM(IF((INDEX(base_indices,1,)=D$13)*(INDEX(base_indices,,1)=$A56),INDEX(base_indices,,),0)))","v":""},{"$f":"IF($A56>date2,\"\",SUM(IF((INDEX(base_indices,1,)=E$13)*(INDEX(base_indices,,1)=$A56),INDEX(base_indices,,),0)))","v":""},{"$f":"IF($A56>date2,\"\",SUM(IF((INDEX(base_indices,1,)=F$13)*(INDEX(base_indices,,1)=$A56),INDEX(base_indices,,),0)))","v":""},{"$f":"IF($A56>date2,\"\",SUM(IF((INDEX(base_indices,1,)=G$13)*(INDEX(base_indices,,1)=$A56),INDEX(base_indices,,),0)))","v":""},{"$f":"IF($A56>date2,\"\",SUM(IF((INDEX(base_indices,1,)=H$13)*(INDEX(base_indices,,1)=$A56),INDEX(base_indices,,),0)))","v":""}]
["",{"$f":"IF(A57>date2,\"\",SUM(IF((INDEX(base_index,1,)=B$13)*(INDEX(base_index,,1)=$A57),INDEX(base_index,,),0)))","v":""},{"$f":"IF(A57>date2,\"\",SUM(IF((INDEX(base_index,1,)=C$13)*(INDEX(base_index,,1)=$A57),INDEX(base_index,,),0)))","v":""},{"$f":"IF($A57>date2,\"\",SUM(IF((INDEX(base_indices,1,)=D$13)*(INDEX(base_indices,,1)=$A57),INDEX(base_indices,,),0)))","v":""},{"$f":"IF($A57>date2,\"\",SUM(IF((INDEX(base_indices,1,)=E$13)*(INDEX(base_indices,,1)=$A57),INDEX(base_indices,,),0)))","v":""},{"$f":"IF($A57>date2,\"\",SUM(IF((INDEX(base_indices,1,)=F$13)*(INDEX(base_indices,,1)=$A57),INDEX(base_indices,,),0)))","v":""},{"$f":"IF($A57>date2,\"\",SUM(IF((INDEX(base_indices,1,)=G$13)*(INDEX(base_indices,,1)=$A57),INDEX(base_indices,,),0)))","v":""},{"$f":"IF($A57>date2,\"\",SUM(IF((INDEX(base_indices,1,)=H$13)*(INDEX(base_indices,,1)=$A57),INDEX(base_indices,,),0)))","v":""}]
["",{"$f":"IF(A58>date2,\"\",SUM(IF((INDEX(base_index,1,)=B$13)*(INDEX(base_index,,1)=$A58),INDEX(base_index,,),0)))","v":""},{"$f":"IF(A58>date2,\"\",SUM(IF((INDEX(base_index,1,)=C$13)*(INDEX(base_index,,1)=$A58),INDEX(base_index,,),0)))","v":""},{"$f":"IF($A58>date2,\"\",SUM(IF((INDEX(base_indices,1,)=D$13)*(INDEX(base_indices,,1)=$A58),INDEX(base_indices,,),0)))","v":""},{"$f":"IF($A58>date2,\"\",SUM(IF((INDEX(base_indices,1,)=E$13)*(INDEX(base_indices,,1)=$A58),INDEX(base_indices,,),0)))","v":""},{"$f":"IF($A58>date2,\"\",SUM(IF((INDEX(base_indices,1,)=F$13)*(INDEX(base_indices,,1)=$A58),INDEX(base_indices,,),0)))","v":""},{"$f":"IF($A58>date2,\"\",SUM(IF((INDEX(base_indices,1,)=G$13)*(INDEX(base_indices,,1)=$A58),INDEX(base_indices,,),0)))","v":""},{"$f":"IF($A58>date2,\"\",SUM(IF((INDEX(base_indices,1,)=H$13)*(INDEX(base_indices,,1)=$A58),INDEX(base_indices,,),0)))","v":""}]
["",{"$f":"IF(A59>date2,\"\",SUM(IF((INDEX(base_index,1,)=B$13)*(INDEX(base_index,,1)=$A59),INDEX(base_index,,),0)))","v":""},{"$f":"IF(A59>date2,\"\",SUM(IF((INDEX(base_index,1,)=C$13)*(INDEX(base_index,,1)=$A59),INDEX(base_index,,),0)))","v":""},{"$f":"IF($A59>date2,\"\",SUM(IF((INDEX(base_indices,1,)=D$13)*(INDEX(base_indices,,1)=$A59),INDEX(base_indices,,),0)))","v":""},{"$f":"IF($A59>date2,\"\",SUM(IF((INDEX(base_indices,1,)=E$13)*(INDEX(base_indices,,1)=$A59),INDEX(base_indices,,),0)))","v":""},{"$f":"IF($A59>date2,\"\",SUM(IF((INDEX(base_indices,1,)=F$13)*(INDEX(base_indices,,1)=$A59),INDEX(base_indices,,),0)))","v":""},{"$f":"IF($A59>date2,\"\",SUM(IF((INDEX(base_indices,1,)=G$13)*(INDEX(base_indices,,1)=$A59),INDEX(base_indices,,),0)))","v":""},{"$f":"IF($A59>date2,\"\",SUM(IF((INDEX(base_indices,1,)=H$13)*(INDEX(base_indices,,1)=$A59),INDEX(base_indices,,),0)))","v":""}]
["",{"$f":"IF(A60>date2,\"\",SUM(IF((INDEX(base_index,1,)=B$13)*(INDEX(base_index,,1)=$A60),INDEX(base_index,,),0)))","v":""},{"$f":"IF(A60>date2,\"\",SUM(IF((INDEX(base_index,1,)=C$13)*(INDEX(base_index,,1)=$A60),INDEX(base_index,,),0)))","v":""},{"$f":"IF($A60>date2,\"\",SUM(IF((INDEX(base_indices,1,)=D$13)*(INDEX(base_indices,,1)=$A60),INDEX(base_indices,,),0)))","v":""},{"$f":"IF($A60>date2,\"\",SUM(IF((INDEX(base_indices,1,)=E$13)*(INDEX(base_indices,,1)=$A60),INDEX(base_indices,,),0)))","v":""},{"$f":"IF($A60>date2,\"\",SUM(IF((INDEX(base_indices,1,)=F$13)*(INDEX(base_indices,,1)=$A60),INDEX(base_indices,,),0)))","v":""},{"$f":"IF($A60>date2,\"\",SUM(IF((INDEX(base_indices,1,)=G$13)*(INDEX(base_indices,,1)=$A60),INDEX(base_indices,,),0)))","v":""},{"$f":"IF($A60>date2,\"\",SUM(IF((INDEX(base_indices,1,)=H$13)*(INDEX(base_indices,,1)=$A60),INDEX(base_indices,,),0)))","v":""}]
["",{"$f":"IF(A61>date2,\"\",SUM(IF((INDEX(base_index,1,)=B$13)*(INDEX(base_index,,1)=$A61),INDEX(base_index,,),0)))","v":""},{"$f":"IF(A61>date2,\"\",SUM(IF((INDEX(base_index,1,)=C$13)*(INDEX(base_index,,1)=$A61),INDEX(base_index,,),0)))","v":""},{"$f":"IF($A61>date2,\"\",SUM(IF((INDEX(base_indices,1,)=D$13)*(INDEX(base_indices,,1)=$A61),INDEX(base_indices,,),0)))","v":""},{"$f":"IF($A61>date2,\"\",SUM(IF((INDEX(base_indices,1,)=E$13)*(INDEX(base_indices,,1)=$A61),INDEX(base_indices,,),0)))","v":""},{"$f":"IF($A61>date2,\"\",SUM(IF((INDEX(base_indices,1,)=F$13)*(INDEX(base_indices,,1)=$A61),INDEX(base_indices,,),0)))","v":""},{"$f":"IF($A61>date2,\"\",SUM(IF((INDEX(base_indices,1,)=G$13)*(INDEX(base_indices,,1)=$A61),INDEX(base_indices,,),0)))","v":""},{"$f":"IF($A61>date2,\"\",SUM(IF((INDEX(base_indices,1,)=H$13)*(INDEX(base_indices,,1)=$A61),INDEX(base_indices,,),0)))","v":""}]
["",{"$f":"IF(A62>date2,\"\",SUM(IF((INDEX(base_index,1,)=B$13)*(INDEX(base_index,,1)=$A62),INDEX(base_index,,),0)))","v":""},{"$f":"IF(A62>date2,\"\",SUM(IF((INDEX(base_index,1,)=C$13)*(INDEX(base_index,,1)=$A62),INDEX(base_index,,),0)))","v":""},{"$f":"IF($A62>date2,\"\",SUM(IF((INDEX(base_indices,1,)=D$13)*(INDEX(base_indices,,1)=$A62),INDEX(base_indices,,),0)))","v":""},{"$f":"IF($A62>date2,\"\",SUM(IF((INDEX(base_indices,1,)=E$13)*(INDEX(base_indices,,1)=$A62),INDEX(base_indices,,),0)))","v":""},{"$f":"IF($A62>date2,\"\",SUM(IF((INDEX(base_indices,1,)=F$13)*(INDEX(base_indices,,1)=$A62),INDEX(base_indices,,),0)))","v":""},{"$f":"IF($A62>date2,\"\",SUM(IF((INDEX(base_indices,1,)=G$13)*(INDEX(base_indices,,1)=$A62),INDEX(base_indices,,),0)))","v":""},{"$f":"IF($A62>date2,\"\",SUM(IF((INDEX(base_indices,1,)=H$13)*(INDEX(base_indices,,1)=$A62),INDEX(base_indices,,),0)))","v":""}]
["",{"$f":"IF(A63>date2,\"\",SUM(IF((INDEX(base_index,1,)=B$13)*(INDEX(base_index,,1)=$A63),INDEX(base_index,,),0)))","v":""},{"$f":"IF(A63>date2,\"\",SUM(IF((INDEX(base_index,1,)=C$13)*(INDEX(base_index,,1)=$A63),INDEX(base_index,,),0)))","v":""},{"$f":"IF($A63>date2,\"\",SUM(IF((INDEX(base_indices,1,)=D$13)*(INDEX(base_indices,,1)=$A63),INDEX(base_indices,,),0)))","v":""},{"$f":"IF($A63>date2,\"\",SUM(IF((INDEX(base_indices,1,)=E$13)*(INDEX(base_indices,,1)=$A63),INDEX(base_indices,,),0)))","v":""},{"$f":"IF($A63>date2,\"\",SUM(IF((INDEX(base_indices,1,)=F$13)*(INDEX(base_indices,,1)=$A63),INDEX(base_indices,,),0)))","v":""},{"$f":"IF($A63>date2,\"\",SUM(IF((INDEX(base_indices,1,)=G$13)*(INDEX(base_indices,,1)=$A63),INDEX(base_indices,,),0)))","v":""},{"$f":"IF($A63>date2,\"\",SUM(IF((INDEX(base_indices,1,)=H$13)*(INDEX(base_indices,,1)=$A63),INDEX(base_indices,,),0)))","v":""}]
["",{"$f":"IF(A64>date2,\"\",SUM(IF((INDEX(base_index,1,)=B$13)*(INDEX(base_index,,1)=$A64),INDEX(base_index,,),0)))","v":""},{"$f":"IF(A64>date2,\"\",SUM(IF((INDEX(base_index,1,)=C$13)*(INDEX(base_index,,1)=$A64),INDEX(base_index,,),0)))","v":""},{"$f":"IF($A64>date2,\"\",SUM(IF((INDEX(base_indices,1,)=D$13)*(INDEX(base_indices,,1)=$A64),INDEX(base_indices,,),0)))","v":""},{"$f":"IF($A64>date2,\"\",SUM(IF((INDEX(base_indices,1,)=E$13)*(INDEX(base_indices,,1)=$A64),INDEX(base_indices,,),0)))","v":""},{"$f":"IF($A64>date2,\"\",SUM(IF((INDEX(base_indices,1,)=F$13)*(INDEX(base_indices,,1)=$A64),INDEX(base_indices,,),0)))","v":""},{"$f":"IF($A64>date2,\"\",SUM(IF((INDEX(base_indices,1,)=G$13)*(INDEX(base_indices,,1)=$A64),INDEX(base_indices,,),0)))","v":""},{"$f":"IF($A64>date2,\"\",SUM(IF((INDEX(base_indices,1,)=H$13)*(INDEX(base_indices,,1)=$A64),INDEX(base_indices,,),0)))","v":""}]
["",{"$f":"IF(A65>date2,\"\",SUM(IF((INDEX(base_index,1,)=B$13)*(INDEX(base_index,,1)=$A65),INDEX(base_index,,),0)))","v":""},{"$f":"IF(A65>date2,\"\",SUM(IF((INDEX(base_index,1,)=C$13)*(INDEX(base_index,,1)=$A65),INDEX(base_index,,),0)))","v":""},{"$f":"IF($A65>date2,\"\",SUM(IF((INDEX(base_indices,1,)=D$13)*(INDEX(base_indices,,1)=$A65),INDEX(base_indices,,),0)))","v":""},{"$f":"IF($A65>date2,\"\",SUM(IF((INDEX(base_indices,1,)=E$13)*(INDEX(base_indices,,1)=$A65),INDEX(base_indices,,),0)))","v":""},{"$f":"IF($A65>date2,\"\",SUM(IF((INDEX(base_indices,1,)=F$13)*(INDEX(base_indices,,1)=$A65),INDEX(base_indices,,),0)))","v":""},{"$f":"IF($A65>date2,\"\",SUM(IF((INDEX(base_indices,1,)=G$13)*(INDEX(base_indices,,1)=$A65),INDEX(base_indices,,),0)))","v":""},{"$f":"IF($A65>date2,\"\",SUM(IF((INDEX(base_indices,1,)=H$13)*(INDEX(base_indices,,1)=$A65),INDEX(base_indices,,),0)))","v":""}]
["",{"$f":"IF(A66>date2,\"\",SUM(IF((INDEX(base_index,1,)=B$13)*(INDEX(base_index,,1)=$A66),INDEX(base_index,,),0)))","v":""},{"$f":"IF(A66>date2,\"\",SUM(IF((INDEX(base_index,1,)=C$13)*(INDEX(base_index,,1)=$A66),INDEX(base_index,,),0)))","v":""},{"$f":"IF($A66>date2,\"\",SUM(IF((INDEX(base_indices,1,)=D$13)*(INDEX(base_indices,,1)=$A66),INDEX(base_indices,,),0)))","v":""},{"$f":"IF($A66>date2,\"\",SUM(IF((INDEX(base_indices,1,)=E$13)*(INDEX(base_indices,,1)=$A66),INDEX(base_indices,,),0)))","v":""},{"$f":"IF($A66>date2,\"\",SUM(IF((INDEX(base_indices,1,)=F$13)*(INDEX(base_indices,,1)=$A66),INDEX(base_indices,,),0)))","v":""},{"$f":"IF($A66>date2,\"\",SUM(IF((INDEX(base_indices,1,)=G$13)*(INDEX(base_indices,,1)=$A66),INDEX(base_indices,,),0)))","v":""},{"$f":"IF($A66>date2,\"\",SUM(IF((INDEX(base_indices,1,)=H$13)*(INDEX(base_indices,,1)=$A66),INDEX(base_indices,,),0)))","v":""}]
["",{"$f":"IF(A67>date2,\"\",SUM(IF((INDEX(base_index,1,)=B$13)*(INDEX(base_index,,1)=$A67),INDEX(base_index,,),0)))","v":""},{"$f":"IF(A67>date2,\"\",SUM(IF((INDEX(base_index,1,)=C$13)*(INDEX(base_index,,1)=$A67),INDEX(base_index,,),0)))","v":""},{"$f":"IF($A67>date2,\"\",SUM(IF((INDEX(base_indices,1,)=D$13)*(INDEX(base_indices,,1)=$A67),INDEX(base_indices,,),0)))","v":""},{"$f":"IF($A67>date2,\"\",SUM(IF((INDEX(base_indices,1,)=E$13)*(INDEX(base_indices,,1)=$A67),INDEX(base_indices,,),0)))","v":""},{"$f":"IF($A67>date2,\"\",SUM(IF((INDEX(base_indices,1,)=F$13)*(INDEX(base_indices,,1)=$A67),INDEX(base_indices,,),0)))","v":""},{"$f":"IF($A67>date2,\"\",SUM(IF((INDEX(base_indices,1,)=G$13)*(INDEX(base_indices,,1)=$A67),INDEX(base_indices,,),0)))","v":""},{"$f":"IF($A67>date2,\"\",SUM(IF((INDEX(base_indices,1,)=H$13)*(INDEX(base_indices,,1)=$A67),INDEX(base_indices,,),0)))","v":""}]
["",{"$f":"IF(A68>date2,\"\",SUM(IF((INDEX(base_index,1,)=B$13)*(INDEX(base_index,,1)=$A68),INDEX(base_index,,),0)))","v":""},{"$f":"IF(A68>date2,\"\",SUM(IF((INDEX(base_index,1,)=C$13)*(INDEX(base_index,,1)=$A68),INDEX(base_index,,),0)))","v":""},{"$f":"IF($A68>date2,\"\",SUM(IF((INDEX(base_indices,1,)=D$13)*(INDEX(base_indices,,1)=$A68),INDEX(base_indices,,),0)))","v":""},{"$f":"IF($A68>date2,\"\",SUM(IF((INDEX(base_indices,1,)=E$13)*(INDEX(base_indices,,1)=$A68),INDEX(base_indices,,),0)))","v":""},{"$f":"IF($A68>date2,\"\",SUM(IF((INDEX(base_indices,1,)=F$13)*(INDEX(base_indices,,1)=$A68),INDEX(base_indices,,),0)))","v":""},{"$f":"IF($A68>date2,\"\",SUM(IF((INDEX(base_indices,1,)=G$13)*(INDEX(base_indices,,1)=$A68),INDEX(base_indices,,),0)))","v":""},{"$f":"IF($A68>date2,\"\",SUM(IF((INDEX(base_indices,1,)=H$13)*(INDEX(base_indices,,1)=$A68),INDEX(base_indices,,),0)))","v":""}]
["",{"$f":"IF(A69>date2,\"\",SUM(IF((INDEX(base_index,1,)=B$13)*(INDEX(base_index,,1)=$A69),INDEX(base_index,,),0)))","v":""},{"$f":"IF(A69>date2,\"\",SUM(IF((INDEX(base_index,1,)=C$13)*(INDEX(base_index,,1)=$A69),INDEX(base_index,,),0)))","v":""},{"$f":"IF($A69>date2,\"\",SUM(IF((INDEX(base_indices,1,)=D$13)*(INDEX(base_indices,,1)=$A69),INDEX(base_indices,,),0)))","v":""},{"$f":"IF($A69>date2,\"\",SUM(IF((INDEX(base_indices,1,)=E$13)*(INDEX(base_indices,,1)=$A69),INDEX(base_indices,,),0)))","v":""},{"$f":"IF($A69>date2,\"\",SUM(IF((INDEX(base_indices,1,)=F$13)*(INDEX(base_indices,,1)=$A69),INDEX(base_indices,,),0)))","v":""},{"$f":"IF($A69>date2,\"\",SUM(IF((INDEX(base_indices,1,)=G$13)*(INDEX(base_indices,,1)=$A69),INDEX(base_indices,,),0)))","v":""},{"$f":"IF($A69>date2,\"\",SUM(IF((INDEX(base_indices,1,)=H$13)*(INDEX(base_indices,,1)=$A69),INDEX(base_indices,,),0)))","v":""}]
["",{"$f":"IF(A70>date2,\"\",SUM(IF((INDEX(base_index,1,)=B$13)*(INDEX(base_index,,1)=$A70),INDEX(base_index,,),0)))","v":""},{"$f":"IF(A70>date2,\"\",SUM(IF((INDEX(base_index,1,)=C$13)*(INDEX(base_index,,1)=$A70),INDEX(base_index,,),0)))","v":""},{"$f":"IF($A70>date2,\"\",SUM(IF((INDEX(base_indices,1,)=D$13)*(INDEX(base_indices,,1)=$A70),INDEX(base_indices,,),0)))","v":""},{"$f":"IF($A70>date2,\"\",SUM(IF((INDEX(base_indices,1,)=E$13)*(INDEX(base_indices,,1)=$A70),INDEX(base_indices,,),0)))","v":""},{"$f":"IF($A70>date2,\"\",SUM(IF((INDEX(base_indices,1,)=F$13)*(INDEX(base_indices,,1)=$A70),INDEX(base_indices,,),0)))","v":""},{"$f":"IF($A70>date2,\"\",SUM(IF((INDEX(base_indices,1,)=G$13)*(INDEX(base_indices,,1)=$A70),INDEX(base_indices,,),0)))","v":""},{"$f":"IF($A70>date2,\"\",SUM(IF((INDEX(base_indices,1,)=H$13)*(INDEX(base_indices,,1)=$A70),INDEX(base_indices,,),0)))","v":""}]
["",{"$f":"IF(A71>date2,\"\",SUM(IF((INDEX(base_index,1,)=B$13)*(INDEX(base_index,,1)=$A71),INDEX(base_index,,),0)))","v":""},{"$f":"IF(A71>date2,\"\",SUM(IF((INDEX(base_index,1,)=C$13)*(INDEX(base_index,,1)=$A71),INDEX(base_index,,),0)))","v":""},{"$f":"IF($A71>date2,\"\",SUM(IF((INDEX(base_indices,1,)=D$13)*(INDEX(base_indices,,1)=$A71),INDEX(base_indices,,),0)))","v":""},{"$f":"IF($A71>date2,\"\",SUM(IF((INDEX(base_indices,1,)=E$13)*(INDEX(base_indices,,1)=$A71),INDEX(base_indices,,),0)))","v":""},{"$f":"IF($A71>date2,\"\",SUM(IF((INDEX(base_indices,1,)=F$13)*(INDEX(base_indices,,1)=$A71),INDEX(base_indices,,),0)))","v":""},{"$f":"IF($A71>date2,\"\",SUM(IF((INDEX(base_indices,1,)=G$13)*(INDEX(base_indices,,1)=$A71),INDEX(base_indices,,),0)))","v":""},{"$f":"IF($A71>date2,\"\",SUM(IF((INDEX(base_indices,1,)=H$13)*(INDEX(base_indices,,1)=$A71),INDEX(base_indices,,),0)))","v":""}]

{"sheet":"Noms index","index":22,"n_rows":23,"n_cols":2,"rows_kept":23,"cut":false,"hidden":true,"merged":[]}
["TP01","Index général tous travaux"]
["TP02","Travaux de génie civil et d’ouvrages d’art neufs ou rénovation"]
["TP03a","Grands terrassements"]
["TP03b","Travaux à l’explosif"]
["TP04","Fondations et travaux géotechniques "]
["TP05a","Travaux en souterrains traditionnels "]
["TP05b","Travaux en souterrains avec tunnelier "]
["TP06a","Grands dragages maritimes "]
["TP06b","Dragages fluviaux et petits dragages maritimes"]
["TP07b","Travaux de génie civil, béton et acier pour ouvrages maritimes"]
["TP08","Travaux d’aménagement et entretien de voirie"]
["TP09","Fabrication et mise en œuvre d’enrobés "]
["TP10a","Canalisations, assainissement et adduction d’eau avec fourniture de tuyaux "]
["TP10b","Canalisations sans fourniture de tuyaux"]
["TP10c","Réhabilitation de canalisations non visitables"]
["TP10d","Réseaux de chauffage et de froid avec fourniture de tuyaux"]
["TP11","Canalisations grandes distances de transport / transfert  avec fourniture de tuyaux"]
["TP12a","Réseaux d'énergie et de communication"]
["TP12b","Éclairage public -Travaux d'installation"]
["TP12c","Éclairage public - Travaux  de maintenance"]
["TP12d","Réseaux de communication en fibre optique"]
["TP13","Charpentes et ouvrages d’art métalliques "]
["TP14","Travaux immergés par scaphandriers"]